program: Gaussian 09
title: 000286860
version: EM64L-G09RevD.01
frameworkgroup: C1[X(C6H9N3O2)]
method: RPBEPBE
basis: SDD
operation: Freq
keyword: #pfreq=noraman
keyword: PBEPBE/SDD
title: #p freq=noraman PBEPBE/SDD
converged: NO NO NO NO
title: Mulliken charges:
elementType: O O N N N C C C C C C H H H H H H H H H
charge: -0.217467 -0.244366 -0.092689 -0.096546 0.020844 0.282964 0.132734 -0.766796 -0.749977 0.031745 -0.505620 0.238689 0.282103 0.238801 0.258287 0.235928 0.235906 0.238339 0.238338 0.238785
chargesum: 0.00000
title: Mulliken charges with hydrogens summed into heavy atoms:
elementType: O O N N N C C C C C C
charge: -0.217467 -0.244366 -0.092689 -0.096546 0.020844 0.282964 0.132734 -0.007204 -0.019856 0.031745 0.209842
polarizability: 1.37036189e+02 4.51746459e+00 1.07472641e+02 -5.52483847e-03 -2.90691737e-03 5.20921432e+01
1716.lowfreq: -72.3647 0.0006 0.0008 0.0008 8.7367 10.6660 11.1158 76.5729 82.8116
frequency: -72.2952 76.4880 82.8058 108.4104 141.9679 193.4934 199.7988 210.2010 288.1084 319.3181 368.9283 390.2708 483.6337 530.5017 571.0439 583.4501 652.3739 686.9790 721.3061 731.3275 906.2455 916.3336 971.9936 995.6688 1027.9747 1052.6745 1092.8794 1111.3615 1128.5992 1154.3610 1206.1435 1294.9768 1343.1198 1365.3328 1395.3825 1409.4277 1412.5771 1450.7352 1454.3737 1458.0866 1459.8249 1460.9892 1470.8378 1483.2773 1547.6661 2984.4530 2988.4044 3003.4450 3058.5016 3065.8202 3105.6039 3120.3362 3125.4410 3148.9603
redmass: 1.0409 1.2737 2.1848 2.6463 1.2137 3.1687 6.5177 4.3395 2.5554 4.6052 3.3945 6.5085 5.9696 7.2756 4.1933 6.5041 4.7597 9.8198 6.5495 8.4612 7.1881 2.4934 4.0700 2.2743 1.4120 1.5519 4.3152 1.2498 2.5786 1.6109 5.4119 7.6980 7.1733 2.2586 1.3507 1.5642 2.1204 1.0513 1.5476 1.1146 1.0463 1.0600 1.5341 1.0449 6.5749 1.0382 1.0387 1.0295 1.0978 1.0969 1.1046 1.0967 1.0986 1.1046
irintensity: 0.1569 0.1417 6.6744 0.7392 0.0786 4.5314 1.1843 2.0155 1.0090 0.0822 1.5068 4.6062 16.5883 1.6847 4.1392 9.1033 4.1496 0.4605 8.2568 12.8996 7.1626 3.5915 27.3342 39.5899 6.3411 0.0210 11.1070 0.0861 22.7608 25.7214 16.1766 433.8645 199.1996 58.1723 3.7321 112.3263 62.2556 16.8436 126.1038 4.9202 7.5640 31.5627 72.0477 32.6368 108.1020 24.4404 3.0031 41.8068 21.7320 4.9828 27.8234 1.1715 7.7305 20.3681
temp: 298.150 k
press: 1.00000 atm
elementType: 8 8 7 7 7 6 6 6 6 6 6 1 1 1 1 1 1 1 1 1
symmnumber: 1
zpe: 397831.4 jmol-1
zpe.correction: 0.151526 hartree
zpe.thermalcorrener: 0.162142 hartree
zpe.thermalcorrenthalpy: 0.163086 hartree
zpe.thermalcorrgfe: 0.115079 hartree
zpe.sumelectzpe: -547.820963 hartree
zpe.sumelectthermal: -547.810347 hartree
zpe.sumelectthermalent: -547.809402 hartree
zpe.sumelectthermalfe: -547.857409 hartree
dipole: -0.1657 5.9970 -0.0003
dipole: 5.9993
quadrupole: -53.6901 -74.3241 -63.4744
quadrupole: -3.1372 0.0002 0.0013
quadrupole: 10.1395 -10.4946 0.3551 -3.1372 0.0002 0.0013
hfenergy: -547.9724885 hartree
pointgroup: C01 [X(C6H9N3O2)]
dipole: -0.0248987 -2.360174 0.0001352 debye
dipolederiv: -1.8360474 0.0805605 -0.000036 -0.1091724 -0.3242 0.0000098 -0.0000097 -0.0000051 -0.3166912 -0.6587369 0.3710263 0.0000579 0.3802517 -0.8184396 -0.0000721 -0.0001946 0.0003312 -0.276506 0.938677 -0.2072599 0.0001189 -0.4857042 1.1006626 0.0000046 0.0001969 -0.0004068 0.1432761 -0.991664 0.0230061 0.0000006 -0.5886933 -0.5883839 -0.0000099 -0.0000542 0.0000401 -0.2081343 -1.0920908 0.1211351 -0.0001595 0.3787161 -0.236353 0. -0.0000158 0.0000775 -0.1962452 0.1244191 0.1292 0.0000226 0.2910963 -0.7875203 0.0000481 0.0002782 0.0000567 0.0088735 0.6004318 -0.1876724 -0.0000099 0.1549958 0.8689358 0.0000609 -0.0000757 -0.0000415 0.0477727 -0.1742796 -0.0039533 0.0000181 -0.1114693 -0.0614478 -0.0000641 -0.0002745 -0.0002305 0.0755101 -0.0152927 -0.17198 -0.0000093 -0.1201711 -0.2501913 -0.0000057 0.0000306 0.0000213 0.0252589 2.0883005 0.0419441 0.0000324 0.3756631 0.4014265 -0.000017 0.000095 0.0000132 0.2635174 0.7811441 -0.1208914 0.0000122 -0.368936 0.3131974 -0.0000139 -0.0000119 -0.0000135 0.2745035 0.0341535 -0.0348064 0.0077741 -0.0597585 0.0636699 0.1066907 0.0653949 0.0934907 -0.0284436 0.1292384 -0.0044974 0.0000463 0.1578091 0.0326923 -0.0002285 0.0001142 -0.0000958 0.1342652 0.0340214 -0.0348159 -0.0078861 -0.0595807 0.0641314 -0.1064195 -0.0654847 -0.093214 -0.0288482 -0.0125297 0.1377575 0.0000409 0.0436114 0.0456007 -0.0000208 0.0000304 -0.0000258 0.1217322 0.0472635 -0.0322039 0.1079406 -0.0079074 0.0553234 -0.0014717 0.0962495 0.0483917 -0.0243778 0.0472107 -0.0321813 -0.1079637 -0.0078748 0.0553355 0.001506 -0.0962733 -0.0483841 -0.0243312 0.0380753 -0.0106512 -0.04825 0.1234185 0.0077833 -0.0899453 0.0014286 -0.0944916 -0.0588682 0.0380603 -0.0106693 0.0482624 0.1234069 0.0077776 0.089956 -0.0014074 0.0944912 -0.0588515 -0.1203545 -0.0530471 -0.0000122 -0.1097011 0.0499997 -0.0000075 -0.0000166 -0.0000048 0.1265875 unknown
polarizability: 137.1818599|-4.0099515|107.3269701|0.0055737|-0.0028121|52.0921432 unknown
InChI: InChI=1S/C6H9N3O2/c1-4-5(2)9(10)8-6(7-4)11-3/h1-3H3
charge 0 multiplicity 1
20 atoms
O  2.535114 0.725759 -0.000031
O  -1.819723 2.121775 -0.000384
N  -0.980285 1.129208 0.000177
N  0.88102 -0.959931 -0.000061
N  0.37477 1.447253 0.000007
C  -1.442207 -0.212053 0.000038
C  -0.465492 -1.229728 -0.000045
C  -2.92808 -0.434137 -0.000088
C  -0.872515 -2.683184 -0.000154
C  1.210226 0.361864 -0.000063
C  3.53188 -0.369319 -0.000009
H  -3.245338 -1.007824 0.890426
H  -3.445665 0.536959 0.00113
H  -3.245566 -1.005568 -0.891989
H  0.030231 -3.312022 -0.000377
H  -1.483148 -2.929615 0.888311
H  -1.483449 -2.929385 -0.888474
H  3.417941 -0.998312 -0.898762
H  3.417854 -0.998365 0.898697
H  4.49833 0.153725 0.000052
