program: Gaussian 09
title: 000286836
version: EM64L-G09RevD.01
frameworkgroup: C1[X(C9H9NO6S)]
method: RPBEPBE
basis: SDD
operation: Freq
keyword: #p
keyword: freq=noraman
keyword: PBEPBE/SDD
title: #p freq=noraman PBEPBE/SDD
converged: YES YES NO NO
title: Mulliken charges:
elementType: S O O O O O O N C C C C C C C C C H H H H H H H H H
charge: 0.986185 -0.281871 -0.402173 -0.489205 -0.499022 -0.191280 -0.185408 0.025322 -0.022811 -0.351230 -0.263460 0.008717 -0.368284 -0.235565 0.410361 -0.164608 -0.344384 0.254762 0.222300 0.232389 0.237731 0.234372 0.334115 0.296644 0.258609 0.297795
chargesum: 0.00000
title: Mulliken charges with hydrogens summed into heavy atoms:
elementType: S O O O O O O N C C C C C C C C C
charge: 0.986185 -0.281871 -0.402173 -0.489205 -0.499022 -0.191280 -0.185408 0.025322 0.231951 0.103459 0.208643 0.008717 -0.034170 0.061078 0.410361 0.094001 -0.046590
polarizability: 2.08200166e+02 9.37750781e+00 1.38090309e+02 1.48128792e+01 -2.01781995e+01 1.27702477e+02
1716.lowfreq: -4.6964 0.0010 0.0019 0.0020 3.3430 7.8400 10.9252 27.7868 33.7869
frequency: 8.2362 27.7385 33.7748 39.0357 57.8351 101.6555 107.7758 137.5810 166.4806 183.7137 202.0993 214.9650 239.0597 267.2365 342.2000 350.0026 379.2807 397.7834 406.9552 427.9180 479.7159 507.0765 516.3319 567.6044 637.2400 667.1786 689.2256 702.7628 706.9452 800.6134 811.2884 821.2591 836.2888 873.3149 918.6046 943.6598 956.1710 960.1930 965.2642 980.3021 1010.7554 1033.9893 1054.2520 1081.5623 1093.7895 1100.2071 1108.9291 1134.0693 1172.0765 1213.1596 1215.1484 1236.9199 1268.3889 1322.8042 1378.4066 1394.9030 1403.4060 1427.5057 1447.3266 1452.6686 1481.0690 1586.0559 1602.2328 2978.4286 3061.7834 3067.8251 3120.6506 3159.5500 3173.1868 3174.2930 3175.8903 3189.8641
redmass: 7.0617 3.9116 7.4560 6.5729 10.7932 7.7294 6.2857 5.3162 5.6208 6.3863 6.3150 5.7627 8.2255 7.4685 7.4007 9.9956 3.3467 9.0335 4.1483 3.4352 7.5025 5.7908 7.2291 9.7667 7.3642 3.3874 9.5050 4.0079 5.7987 10.1626 3.0125 1.4339 13.0530 2.1319 5.1607 1.4290 2.2747 1.4269 2.8131 5.9186 1.3665 1.3497 1.9417 2.0237 1.5533 2.4185 1.3780 1.5615 1.1294 6.5591 1.2778 1.6187 1.3232 1.2678 8.5110 1.8478 8.5220 3.0582 2.3764 1.0861 1.1808 6.9752 7.7077 1.0581 1.1036 1.0538 1.0915 1.0890 1.0933 1.0935 1.1187 1.0982
irintensity: 2.7757 9.5903 1.2901 2.7757 2.4946 2.0706 6.4752 5.4579 0.4640 2.0374 0.2507 3.7223 5.9843 5.1410 7.4006 12.1036 23.1799 0.1256 2.2506 2.7831 91.2332 4.0382 3.0324 125.2218 9.7214 14.9172 17.3853 28.3160 13.6331 29.7885 36.6843 43.7419 66.2119 29.2617 93.8896 15.0174 47.6416 5.0641 32.8571 1.0233 1.1613 9.4677 26.0652 25.2320 17.4485 16.7083 7.9397 1.8042 19.4225 215.0570 20.5146 2.9305 0.1529 8.7713 72.8480 3.3365 6.4139 55.8550 21.3273 20.1217 1.2215 1.6483 3.2629 32.7629 8.1431 32.0315 10.3660 4.2949 6.9514 16.0862 24.5442 2.0092
temp: 298.150 k
press: 1.00000 atm
elementType: 16 8 8 8 8 8 8 7 6 6 6 6 6 6 6 6 6 1 1 1 1 1 1 1 1 1
symmnumber: 1
zpe: 459087.7 jmol-1
zpe.correction: 0.174857 hartree
zpe.thermalcorrener: 0.191817 hartree
zpe.thermalcorrenthalpy: 0.192761 hartree
zpe.thermalcorrgfe: 0.125792 hartree
zpe.sumelectzpe: -1250.923584 hartree
zpe.sumelectthermal: -1250.906624 hartree
zpe.sumelectthermalent: -1250.905680 hartree
zpe.sumelectthermalfe: -1250.972649 hartree
dipole: 1.1258 0.5789 -1.8835
dipole: 2.2694
quadrupole: -101.1484 -111.8526 -113.1025
quadrupole: -20.7870 18.1022 -8.0466
quadrupole: 7.5528 -3.1514 -4.4014 -20.7870 18.1022 -8.0466
hfenergy: -1251.0984409 hartree
pointgroup: C01 [X(C9H9N1O6S1)]
dipole: 0.4560281 0.4152192 -0.6456276 debye
dipolederiv: 2.0274662 -0.1020483 0.0953429 -0.2975611 1.2799912 0.1441416 -0.1128259 0.2960018 1.4380823 -0.2793605 0.0146004 -0.0025384 -0.0443328 -0.3679694 0.115835 0.146642 -0.005445 -0.6261814 -1.0851352 0.2228562 0.0875704 0.315031 -0.5061063 -0.0713707 0.1049884 -0.1049371 -0.5202504 -0.6695976 -0.0478818 -0.0680612 0.0950671 -0.6799012 -0.1153893 -0.0226328 -0.0422584 -0.4860831 -0.6946216 0.0316492 -0.0226362 0.0187499 -0.4628765 0.1033263 0.0347699 -0.0354015 -0.6305882 -0.7927431 -0.0952192 -0.2175256 -0.2181237 -0.4362756 0.0433602 -0.1819195 0.0857755 -0.361655 -0.4737004 -0.0809447 -0.0763299 -0.0995851 -0.6233219 0.2360525 -0.0836742 0.2167265 -0.395007 1.2260399 0.4059532 0.257862 0.6099522 1.1274483 -0.3247331 0.1843359 -0.3647665 0.5316441 -0.104281 0.1582992 0.0787274 0.0102 0.2859425 0.0424471 -0.35139 0.1778333 0.3929748 0.2580413 -0.0312351 0.0144612 0.0751303 0.2421815 0.0030978 0.1239201 0.0336462 0.1931499 0.8636253 -0.2475699 -0.1383872 -0.1054489 0.211982 -0.0677113 0.3742187 -0.2150225 0.0609571 0.0860779 -0.0170826 0.1064588 -0.0381485 -0.2289684 0.0006869 0.0966966 -0.0120804 -0.1670379 -0.0996187 0.0916629 -0.0511162 0.1387941 -0.0468789 0.0566485 -0.1093138 0.0412591 -0.1007802 -0.1483184 0.1158551 -0.0714683 -0.155458 0.0126632 -0.1032396 0.0558927 0.0295982 -0.0359469 -0.1981756 -0.1878777 -0.016365 -0.3448098 -0.2371403 0.0407859 0.0759457 0.1019447 0.051074 -0.2196441 -0.1435695 0.0437101 -0.0636237 0.0259826 -0.1197037 -0.0131215 -0.16598 -0.000467 -0.0026248 -0.0186524 0.0714171 0.1863701 0.0486001 0.0092415 -0.0741968 -0.0932578 -0.0517425 0.0116935 -0.1086917 0.0225215 -0.0761506 -0.0043636 -0.0164915 0.0571212 -0.0499276 0.0381241 -0.0231581 -0.0203127 -0.0837104 -0.0690446 0.0012313 -0.0662912 -0.1206446 -0.0397878 0.0386839 0.0006755 0.0834531 -0.0070271 0.0989284 -0.0915305 -0.0299879 0.0004286 -0.0580381 0.0720888 -0.1475102 -0.0086916 0.0059551 -0.0501092 -0.0341105 -0.0235485 -0.0181049 0.0194364 0.0886525 -0.0060693 0.0223925 0.0811497 0.0383951 0.0492628 0.0319647 -0.0750106 0.0822536 -0.0384566 0.2068875 0.010333 -0.0090609 0.0407892 0.1463751 0.0139243 -0.0057929 0.0165115 0.1441045 0.1282512 -0.0604167 0.0071353 -0.0442289 0.1103192 0.0135681 0.0132045 -0.0160442 0.1487192 0.0569591 0.0097771 -0.054916 0.0007027 0.0257372 0.083995 -0.0633264 0.090058 0.0742258 0.0788414 0.0033621 -0.0531689 -0.0214855 0.1517261 -0.0006085 -0.03621 0.0119023 0.1417149 unknown
polarizability: 208.5962205|2.4191985|148.109526|15.9945476|-14.572975|117.2872056 unknown
InChI: InChI=1S/C9H9NO6S/c11-10(12)7-2-1-3-9(4-7)17(13,14)16-6-8-5-15-8/h1-4,8H,5-6H2
charge 0 multiplicity 1
26 atoms
S  0.917856 1.084363 1.081015
O  4.327145 -0.933302 -1.977515
O  1.879501 0.15489 -0.223011
O  1.42717 2.617478 1.162797
O  0.857232 0.158221 2.410168
O  -4.842939 -1.194527 -0.72315
O  -3.34912 -2.159784 0.707595
N  -3.720987 -1.218292 -0.089137
C  3.651041 -1.371469 -0.703932
C  5.110952 -1.653025 -0.909918
C  3.22255 -0.276974 0.244527
C  -0.721617 1.01899 0.163859
C  -1.556937 -0.079678 0.394755
C  -1.035646 2.089706 -0.689279
C  -2.787312 -0.074258 -0.294462
C  -2.279402 2.052442 -1.361678
C  -3.161719 0.968191 -1.170014
H  2.925523 -2.182518 -0.842075
H  5.857284 -1.035851 -0.393276
H  5.4268 -2.671136 -1.165923
H  3.927663 0.573053 0.207437
H  3.14614 -0.673434 1.277972
H  -1.292826 -0.892631 1.077776
H  -0.338155 2.924495 -0.810803
H  -2.556171 2.868672 -2.035038
H  -4.128626 0.916073 -1.677389
