program: Gaussian 09
title: 000286832
version: EM64L-G09RevD.01
frameworkgroup: C1[X(C9H9NO6S)]
method: RPBEPBE
basis: SDD
operation: Freq
keyword: #p
keyword: freq=noraman
keyword: PBEPBE/SDD
title: #p freq=noraman PBEPBE/SDD
converged: YES YES NO NO
title: Mulliken charges:
elementType: S O O O O O O N C C C C C C C C C H H H H H H H H H
charge: 0.994628 -0.317403 -0.378926 -0.499090 -0.488206 -0.193454 -0.191989 0.027724 -0.000165 -0.340435 -0.330436 -0.068863 -0.217044 -0.173653 -0.330168 -0.345361 0.396662 0.258472 0.229819 0.234645 0.262676 0.235668 0.302368 0.329522 0.300851 0.302159
chargesum: 0.00000
title: Mulliken charges with hydrogens summed into heavy atoms:
elementType: S O O O O O O N C C C C C C C C C
charge: 0.994628 -0.317403 -0.378926 -0.499090 -0.488206 -0.193454 -0.191989 0.027724 0.258307 0.124029 0.167908 -0.068863 0.085323 0.155869 -0.029317 -0.043203 0.396662
polarizability: 2.12790310e+02 7.89724835e-01 1.61708792e+02 8.44752110e+00 1.60118717e+01 9.41395478e+01
1716.lowfreq: -7.1244 -4.4809 -0.0022 -0.0012 0.0008 8.5214 26.5189 44.4439 48.7999
frequency: 26.3427 44.4313 48.7614 64.5080 82.1540 86.2762 109.7671 137.7429 181.9575 202.2660 221.1191 239.2744 251.7205 283.7844 332.8856 367.2764 375.5975 410.5229 412.5275 438.9867 484.2483 491.7214 505.4043 532.5645 610.7201 659.6899 679.7357 691.1652 731.3786 782.3378 814.6658 829.1394 851.2293 862.6304 870.8250 920.0022 932.7099 968.8026 987.1473 992.4076 1000.5916 1027.0777 1041.8827 1086.0333 1095.3529 1109.6997 1112.7186 1142.7335 1178.9057 1217.4255 1229.8613 1252.0883 1291.0460 1320.5125 1372.5070 1391.4465 1393.0826 1423.3126 1427.7077 1453.5502 1478.1115 1578.5742 1604.1783 2970.2678 3044.5638 3072.5169 3119.3577 3149.3467 3165.5158 3182.4775 3189.2938 3191.0839
redmass: 5.7403 8.6745 5.3059 7.4726 4.5771 5.7931 9.1553 9.2707 8.6050 12.3882 9.4742 5.0095 6.1756 6.1909 7.0033 2.5876 11.6271 3.3919 5.7139 4.5085 9.6228 3.8397 7.2365 7.1872 7.1066 5.0195 8.8079 5.5823 4.2632 9.6873 2.9456 13.0119 1.2447 2.9175 1.5215 3.9831 1.6380 17.3833 2.8273 1.7855 1.3787 1.2456 2.3090 4.0098 1.5116 1.3333 1.3618 1.6411 1.2744 7.5152 1.4628 1.2700 1.2576 1.2717 6.4588 5.6509 1.6885 6.0318 1.1263 2.0580 1.1775 6.0486 8.3103 1.0598 1.1016 1.0532 1.0919 1.0941 1.0909 1.1189 1.0945 1.0959
irintensity: 0.5952 0.6425 0.6042 1.6326 4.4565 6.8446 7.6631 4.5684 1.9113 4.1225 2.1779 0.1439 8.5868 0.3082 0.7252 4.0387 39.0434 4.1166 28.1803 23.5322 37.3935 22.9564 1.5009 104.3872 1.9244 29.1740 29.7952 9.3958 6.6004 37.9875 29.8596 80.1334 5.3908 33.2880 58.8340 56.7877 19.5000 81.7426 1.9885 3.4339 0.8376 1.9784 21.7032 6.5250 2.7293 1.7608 11.8568 7.9197 17.4416 244.2065 3.5256 8.3959 0.1204 5.4716 55.6513 57.4578 5.8138 57.0977 32.1523 9.2923 2.2258 17.4325 0.3128 18.4793 6.1907 28.8719 12.0074 39.1914 7.1062 20.1834 6.3774 1.0987
temp: 298.150 k
press: 1.00000 atm
elementType: 16 8 8 8 8 8 8 7 6 6 6 6 6 6 6 6 6 1 1 1 1 1 1 1 1 1
symmnumber: 1
zpe: 459541.0 jmol-1
zpe.correction: 0.175030 hartree
zpe.thermalcorrener: 0.191679 hartree
zpe.thermalcorrenthalpy: 0.192624 hartree
zpe.thermalcorrgfe: 0.128703 hartree
zpe.sumelectzpe: -1250.927702 hartree
zpe.sumelectthermal: -1250.911052 hartree
zpe.sumelectthermalent: -1250.910108 hartree
zpe.sumelectthermalfe: -1250.974028 hartree
dipole: 3.8843 2.6357 -1.2822
dipole: 4.8661
quadrupole: -113.0813 -108.9426 -108.6801
quadrupole: 23.6603 -5.0971 -0.3537
quadrupole: -2.8466 1.2920 1.5546 23.6603 -5.0971 -0.3537
hfenergy: -1251.1027315 hartree
pointgroup: C01 [X(C9H9N1O6S1)]
dipole: 1.6607613 -0.9186547 -0.2512991 debye
dipolederiv: 1.8748192 -0.0390543 0.0978684 -0.1505142 1.5386553 0.2126486 0.2011008 0.0777775 1.1490757 -0.6376052 0.0575927 -0.1465822 0.1594173 -0.3837579 -0.015299 -0.10603 -0.0297559 -0.4072999 -0.8623036 0.3010786 0.1128601 0.3060685 -0.7032206 -0.1012667 0.154454 -0.1452986 -0.4302024 -0.6670287 -0.0708883 -0.0070303 -0.0361309 -0.5690638 0.0008269 -0.0325172 0.0944816 -0.4969607 -0.6490358 0.0156879 0.0109095 -0.017998 -0.5265423 -0.1258821 0.005517 -0.1661171 -0.5938742 -0.8443345 -0.0729012 0.1343999 -0.1188174 -0.271336 -0.0788694 0.084248 -0.0898661 -0.4903614 -0.570194 -0.1119483 -0.1002722 -0.1192878 -0.3215244 -0.2168135 -0.081248 -0.1958574 -0.6861883 1.5891756 0.3374408 0.1097034 0.4073172 0.4168454 0.3715638 0.1582461 0.3581439 1.0314661 0.0908548 0.0939721 0.1282702 -0.0347203 0.3099 -0.0409699 0.083317 -0.0455544 0.1596792 0.2803366 0.0216157 -0.076934 0.0532229 0.2408667 0.0220827 0.0188065 0.0367448 0.1126075 0.4871518 -0.2807795 -0.0715718 -0.1569671 0.1654319 0.1221246 -0.4064325 0.2881365 0.2922935 0.1279949 0.0437744 0.0018231 0.0660399 -0.1627721 0.0298909 0.0590985 0.0659895 0.0098541 -0.3214795 0.0083859 0.1073508 -0.1456109 -0.0790643 0.0431724 -0.2351619 -0.0234754 -0.0430943 -0.2326639 -0.1113837 -0.2386121 -0.0171965 -0.0881729 -0.0742848 -0.0134956 -0.0172977 -0.1382516 0.0179244 -0.0272202 -0.14082 0.1141438 -0.0656668 -0.0119269 0.2285596 0.0594796 -0.0413364 0.0380299 0.1104102 0.2038838 -0.0278256 -0.0622797 0.06859 -0.1470442 -0.0209337 -0.0409607 -0.3840349 -0.1567031 -0.1795354 -0.1993466 0.0130631 -0.0634854 -0.2015488 -0.058715 0.0247013 0.1099285 -0.0793454 -0.0127456 -0.0126376 -0.057178 0.0318563 -0.0033784 0.0521034 -0.0036706 -0.0270594 -0.0490233 0.0610148 -0.1052014 -0.0340876 0.0247123 0.0254503 -0.0001278 0.1017971 0.0126089 0.0265314 0.0577661 0.0674208 -0.0478454 -0.0973447 0.0811428 -0.1080984 0.042327 0.1257277 0.0131905 0.0095552 -0.0563602 0.0234961 0.0262438 0.1063765 0.0048302 0.0506588 -0.1203368 0.0802284 -0.0554778 0.1370403 0.0542682 -0.0285149 0.0008689 -0.0463699 -0.017253 0.1592244 -0.0238616 -0.0300893 0.0039657 0.1379848 -0.0397557 0.0071219 -0.0280929 0.08741 0.2186871 -0.0593078 0.0012571 -0.0769865 0.1574073 0.0000556 -0.004005 -0.0079935 0.1283314 0.0686966 -0.0061379 0.0434313 -0.0250752 0.1649414 -0.0145854 0.0056391 -0.0208505 0.116739 0.1149161 -0.0213541 -0.0204231 -0.0139602 0.1496515 -0.0447694 0.0109144 -0.0332828 0.0825128 unknown
polarizability: 212.1908881|10.7631028|107.9483308|-0.1049258|31.5184519|148.4994308 unknown
InChI: InChI=1S/C9H9NO6S/c11-10(12)7-1-3-9(4-2-7)17(13,14)16-6-8-5-15-8/h1-4,8H,5-6H2
charge 0 multiplicity 1
26 atoms
S  1.365509 1.442869 1.261705
O  2.532757 -1.03626 -1.513105
O  2.32582 -0.16402 1.596308
O  2.176516 2.253579 0.113368
O  1.051297 2.102038 2.699512
O  -4.93168 -0.697347 -0.177336
O  -3.896584 -1.24489 -2.135286
N  -3.895636 -0.756775 -0.942429
C  3.312722 -1.415153 -0.269741
C  4.001142 -1.368604 -1.602417
C  3.523721 -0.311903 0.74265
C  -0.244337 0.745905 0.568704
C  -1.373587 0.812385 1.401799
C  -0.239105 0.213524 -0.731939
C  -2.590674 0.313145 0.89507
C  -1.460573 -0.284643 -1.231233
C  -2.607856 -0.225503 -0.409743
H  3.015647 -2.389626 0.137686
H  4.646107 -0.51446 -1.844325
H  4.22988 -2.305902 -2.12239
H  3.746456 0.648819 0.233546
H  4.353697 -0.555934 1.432883
H  -1.300468 1.243483 2.404878
H  0.677857 0.166619 -1.328491
H  -3.509907 0.333225 1.485389
H  -1.530823 -0.71787 -2.231864
