program: Gaussian 09
title: 000286830
version: EM64L-G09RevD.01
frameworkgroup: C1[X(C11H14O4S)]
method: RPBEPBE
basis: SDD
operation: Freq
keyword: #p
keyword: freq=noraman
keyword: PBEPBE/SDD
title: #p freq=noraman PBEPBE/SDD
converged: YES YES NO NO
title: Mulliken charges:
elementType: S O O O O C C C C C C C C C C C H H H H H H H H H H H H H H
charge: 0.967589 -0.297778 -0.396129 -0.520166 -0.501821 -0.014491 -0.350395 -0.294732 -0.219384 0.515568 -0.254040 -0.591425 0.479197 -0.361015 -0.823430 -0.803474 0.255576 0.224973 0.228964 0.252412 0.219172 0.297175 0.247555 0.246999 0.267813 0.299509 0.220593 0.230184 0.237329 0.237670
chargesum: 0.00000
title: Mulliken charges with hydrogens summed into heavy atoms:
elementType: S O O O O C C C C C C C C C C C
charge: 0.967589 -0.297778 -0.396129 -0.520166 -0.501821 0.241086 0.103543 0.176852 -0.219384 0.515568 0.043135 -0.343870 0.479197 -0.114015 -0.035515 -0.098291
polarizability: 2.20398219e+02 -2.31118157e+00 1.56249266e+02 -1.55170428e+01 -1.19746302e+01 1.09829304e+02
1716.lowfreq: -28.3791 -15.9658 -6.4503 -0.0022 -0.0006 0.0009 10.6145 24.1357 40.3951
frequency: -28.2870 23.6334 40.3075 51.7046 63.9262 87.3994 112.4221 131.9584 147.6198 172.6381 204.1303 216.7251 224.1771 238.0201 272.5040 290.4260 318.1976 364.4860 378.5940 417.5129 450.6219 455.7391 463.9162 534.1920 543.6515 556.1426 585.9153 696.8497 708.0176 711.7554 811.9071 825.3298 833.0825 871.6442 893.8352 915.5907 923.7874 949.3537 951.1334 975.4653 985.2356 990.7216 1023.4582 1029.2655 1046.1707 1051.1194 1097.7884 1110.3943 1140.6120 1150.6007 1176.0584 1223.9465 1241.5108 1245.8540 1285.1003 1323.9522 1368.8303 1390.5716 1392.0158 1401.9263 1412.3575 1452.0550 1454.8983 1461.5912 1469.4488 1476.5747 1479.2088 1487.8640 1580.1869 1606.2810 2968.6772 2983.1602 2990.7830 3035.0163 3062.4577 3067.3637 3073.7759 3093.3199 3101.8991 3118.8134 3130.2473 3139.3124 3162.7416 3176.1472
redmass: 1.0296 5.4783 4.7906 4.7200 4.2396 2.7854 1.3749 4.6823 4.6468 5.1312 2.7951 4.8290 6.1211 6.3092 4.9404 3.3297 4.7532 5.8466 3.2115 3.9263 3.1779 3.5051 7.2602 5.3419 4.1652 4.9799 6.3277 5.5462 3.4194 5.1641 3.4978 5.9277 1.3865 2.2979 1.2815 3.1512 4.3777 1.6339 11.0536 1.3257 2.4375 2.3467 1.5108 1.2952 1.5383 1.6060 1.4718 1.3567 1.6707 1.4217 1.6139 1.2785 1.4564 2.5034 1.5821 1.2756 4.9386 1.8808 2.2258 1.4587 1.2406 1.2657 1.7344 1.0445 1.0451 1.1781 1.1776 1.1527 6.1294 6.4558 1.0554 1.0375 1.0375 1.1063 1.0974 1.0531 1.0963 1.0990 1.1000 1.0915 1.0915 1.0891 1.0963 1.1188
irintensity: 0.5525 1.6701 2.8533 2.7846 1.7960 2.7088 0.2291 6.7262 4.2012 1.2327 3.0624 2.2217 12.3860 3.3075 4.3546 1.4840 2.7661 15.4717 13.2337 10.2523 0.9084 19.0997 81.7623 1.8065 15.1997 79.1867 58.2565 8.3213 0.4896 2.4382 46.0771 84.3726 14.4674 32.9085 1.9984 9.5327 62.4294 45.6416 67.5868 0.7684 0.8914 1.0517 6.8466 12.3604 1.1755 22.7561 5.4708 7.3781 5.1660 2.0105 5.6699 4.7395 10.1192 19.6054 3.2965 4.3313 10.6834 2.1472 6.0090 17.7144 16.8101 12.6143 10.0684 20.8921 16.1946 2.1423 24.1295 33.9156 10.9375 19.6072 52.6794 23.7309 9.9979 14.5617 15.4152 34.0180 3.6814 15.4369 14.0041 15.0831 14.0763 7.6930 9.7856 26.0346
temp: 298.150 k
press: 1.00000 atm
elementType: 16 8 8 8 8 6 6 6 6 6 6 6 6 6 6 6 1 1 1 1 1 1 1 1 1 1 1 1 1 1
symmnumber: 1
zpe: 598573.2 jmol-1
zpe.correction: 0.227984 hartree
zpe.thermalcorrener: 0.244848 hartree
zpe.thermalcorrenthalpy: 0.245792 hartree
zpe.thermalcorrgfe: 0.181978 hartree
zpe.sumelectzpe: -1125.090936 hartree
zpe.sumelectthermal: -1125.074072 hartree
zpe.sumelectthermalent: -1125.073128 hartree
zpe.sumelectthermalfe: -1125.136943 hartree
dipole: 1.0311 -3.3653 -1.5496
dipole: 3.8457
quadrupole: -67.2823 -112.5433 -105.9681
quadrupole: -0.5404 1.9569 -2.9558
quadrupole: 27.9823 -17.2788 -10.7035 -0.5404 1.9569 -2.9558
hfenergy: -1125.3189207 hartree
pointgroup: C01 [X(C11H14O4S1)]
dipole: -0.4337156 -1.3486057 -0.5313779 debye
polarizability: 219.4252088|13.8076674|119.4677543|-12.3500457|21.7187144|147.5838253 unknown
InChI: InChI=1S/C11H14O4S/c1-8-3-4-11(9(2)5-8)16(12,13)15-7-10-6-14-10/h3-5,10H,6-7H2,1-2H3
charge 0 multiplicity 1
30 atoms
S  0.430479 1.353968 0.975515
O  2.93247 -1.441642 -1.459086
O  1.510153 -0.199063 1.104705
O  1.085252 2.281881 -0.189114
O  0.237192 1.976769 2.455658
C  3.349056 -1.256927 -0.017857
C  4.381937 -1.219332 -1.105619
C  2.90143 0.020749 0.654331
C  -1.173445 0.514893 0.454311
C  -1.316203 -0.045223 -0.836676
C  -2.173742 0.512596 1.442477
C  -2.585945 -0.628417 -1.096888
C  -3.633459 -0.660834 -0.143133
C  -3.412108 -0.080828 1.133959
C  -0.230515 -0.053852 -1.892093
C  -4.969338 -1.299204 -0.474841
H  3.245395 -2.17013 0.581143
H  4.787673 -0.251256 -1.426141
H  5.03492 -2.086921 -1.257163
H  2.939141 0.869758 -0.058243
H  3.53906 0.243047 1.532994
H  -1.978911 0.968014 2.4186
H  -2.749183 -1.074416 -2.085274
H  -4.207411 -0.093881 1.887565
H  0.141786 0.965931 -2.092645
H  0.644445 -0.650279 -1.574239
H  -0.611873 -0.483653 -2.832541
H  -4.982106 -1.713788 -1.49657
H  -5.202429 -2.120715 0.22776
H  -5.791623 -0.563643 -0.397395
