program: Gaussian 09
title: 000286872
version: EM64L-G09RevD.01
frameworkgroup: C1[X(C20H20N2O6)]
method: RPBEPBE
basis: SDD
operation: Freq
keyword: #p
keyword: freq=noraman
keyword: PBEPBE/SDD
title: #p freq=noraman PBEPBE/SDD
converged: YES YES NO NO
title: Mulliken charges:
elementType: O O O O O O N N C C C C C C C C C C C C C C C C C C C C H H H H H H H H H H H H H H H H H H H H
charge: -0.296554 -0.296588 -0.262904 -0.284454 -0.234228 -0.221656 -0.031440 0.014397 -0.632542 0.039556 0.213465 0.537082 0.529935 0.257728 -0.529850 -0.557870 -0.592370 0.186214 -0.352400 0.221982 0.192780 -0.555153 0.243559 -0.394394 -0.529252 -0.529194 -0.496690 -0.536043 0.257394 0.232193 0.267297 0.264492 0.258822 0.237633 0.295929 0.238191 0.252847 0.231392 0.229698 0.231882 0.224359 0.257883 0.227955 0.248137 0.230487 0.233303 0.232934 0.244053
chargesum: 0.00000
title: Mulliken charges with hydrogens summed into heavy atoms:
elementType: O O O O O O N N C C C C C C C C C C C C C C C C C C C C
charge: -0.296554 -0.296588 -0.262904 -0.284454 -0.234228 -0.221656 -0.031440 0.014397 -0.142955 0.039556 0.213465 0.537082 0.529935 0.257728 -0.262552 -0.293378 -0.333548 0.186214 -0.114767 0.221982 0.192780 -0.259224 0.243559 -0.156204 0.184685 0.184931 0.209889 0.174248
polarizability: 4.20218022e+02 -1.43535262e+01 2.26777248e+02 3.30465991e+01 1.12420872e+01 2.08661962e+02
1716.lowfreq: -4.1252 -3.1574 -0.0009 -0.0006 0.0003 8.2627 9.3235 21.7803 31.6288
frequency: 8.8261 21.5601 31.6255 37.0554 52.8170 64.4923 67.8284 85.8384 97.3588 106.0179 114.2704 134.4614 143.3541 153.4858 156.6108 162.1822 166.8405 171.4787 208.4385 217.6657 227.9277 234.0307 264.9410 285.3478 302.1438 303.6089 312.7912 338.2631 345.8486 374.1930 377.9072 396.1367 417.1343 431.8805 460.6412 464.4066 484.1222 518.3087 540.1229 557.6795 575.4189 579.4235 593.5915 641.7022 652.7646 675.0394 702.3112 708.0263 718.4359 729.4856 737.6125 743.7150 776.0469 783.2793 809.8376 829.7592 857.2097 883.1650 893.9640 899.4614 901.5163 909.5130 925.3961 939.8964 950.8759 966.9997 985.7364 998.7111 1052.8235 1069.6183 1102.6667 1107.7377 1113.1802 1113.5679 1116.5048 1135.8858 1149.6602 1155.2445 1158.2034 1169.3411 1179.7383 1188.1672 1207.2288 1207.6964 1231.7479 1238.6520 1259.5693 1267.6792 1271.4104 1277.5109 1327.0736 1339.8772 1370.5888 1378.7888 1398.2648 1403.4971 1409.7247 1424.4916 1436.1412 1437.4175 1445.9476 1449.0870 1455.0405 1455.8782 1458.4488 1461.6218 1462.9125 1467.3327 1474.7239 1477.3046 1485.7289 1487.7761 1503.2495 1549.6478 1564.4621 1571.9589 1621.2354 1629.0150 2968.7293 2975.0518 2976.7271 2983.7310 3001.5333 3049.4797 3060.4646 3073.3087 3075.9036 3112.1182 3124.4966 3125.9795 3129.8393 3132.8471 3134.5405 3152.4106 3157.8761 3157.9275 3170.0821 3185.7049
redmass: 6.1032 5.5591 4.6947 3.7688 5.3670 4.4547 4.2815 5.7513 3.9657 3.7223 3.5242 2.8718 2.4442 1.4506 1.4188 1.2925 3.0930 3.2478 2.8605 3.5208 4.3619 2.9816 1.5965 6.2792 5.8575 4.8886 4.0827 3.5873 4.6945 5.7087 4.2762 5.0354 5.6327 7.2026 3.9163 4.9251 3.4896 6.1715 3.6139 5.8484 5.6250 6.3727 5.3018 6.6311 5.0054 6.6135 7.2119 7.4742 4.8726 4.3489 6.4558 3.9802 4.6470 3.2340 4.8408 1.3204 5.6997 1.6673 1.6519 1.8923 1.9785 2.2060 7.2374 2.2440 6.8365 1.4463 5.6921 4.5730 4.2730 2.4892 3.4189 1.2433 1.2578 1.2412 1.2632 1.7333 1.3589 1.4747 1.4835 2.3265 1.6952 1.8348 5.7272 1.4159 1.9058 1.5542 1.7163 1.5926 2.5466 5.4928 3.2930 6.7130 3.0876 4.4911 3.4996 5.0786 3.2366 1.3281 1.2829 1.3306 1.3559 1.7523 1.2950 1.0602 1.0814 1.1003 1.0531 1.0493 1.0908 1.0558 1.4521 1.9566 3.3247 8.0851 8.4967 6.1555 7.6433 7.2152 1.0324 1.0307 1.0312 1.0635 1.0296 1.0946 1.1045 1.1042 1.1035 1.1032 1.1029 1.1032 1.1005 1.0868 1.1059 1.0924 1.0964 1.0937 1.0908 1.0898
irintensity: 1.0974 1.0825 1.2463 4.8861 0.3726 1.0812 3.2024 5.3357 5.8965 0.4965 7.8582 3.8185 0.4751 0.8533 0.6740 1.6387 6.1694 5.8803 2.6784 4.0713 7.1067 2.4420 0.1029 7.3830 5.4486 7.5003 1.1920 5.5057 0.5981 6.9100 1.8806 0.2181 6.4981 6.9649 0.4774 2.9363 4.3211 13.0972 0.6876 4.8538 6.1142 5.8523 3.5350 19.1556 16.1185 1.5628 2.9685 6.9596 0.6482 18.6507 9.0588 15.8027 8.2156 0.3426 0.5387 12.9623 2.0149 3.8421 10.9630 27.8805 19.6444 71.8131 47.4344 6.9976 104.8619 2.1146 82.2349 6.8454 62.5905 7.3580 81.0435 2.1068 0.0467 23.1464 4.1898 32.3043 7.9955 47.2232 8.0836 134.0875 74.0036 22.4581 389.2779 78.8351 54.0045 35.6212 8.0996 8.0028 83.1408 371.1419 96.5639 131.4878 13.7308 46.5112 45.7778 8.3573 29.2070 7.0300 27.9076 3.3579 16.1486 61.2955 9.4967 18.3691 13.2934 4.4643 32.0087 13.5450 91.0295 6.4951 10.5531 153.5033 192.9334 30.5140 137.8235 6.7861 49.2724 13.7947 52.3475 79.9116 76.8297 16.8359 77.1143 2.5700 35.3545 27.1400 21.5799 33.7281 24.3132 24.2045 22.5707 2.5354 20.7661 3.6835 30.8143 12.4579 1.8996 5.7744
temp: 298.150 k
press: 1.00000 atm
elementType: 8 8 8 8 8 8 7 7 6 6 6 6 6 6 6 6 6 6 6 6 6 6 6 6 6 6 6 6 1 1 1 1 1 1 1 1 1 1 1 1 1 1 1 1 1 1 1 1
symmnumber: 1
zpe: 961070.0 jmol-1
zpe.correction: 0.366052 hartree
zpe.thermalcorrener: 0.393153 hartree
zpe.thermalcorrenthalpy: 0.394097 hartree
zpe.thermalcorrgfe: 0.305963 hartree
zpe.sumelectzpe: -1332.794973 hartree
zpe.sumelectthermal: -1332.767873 hartree
zpe.sumelectthermalent: -1332.766929 hartree
zpe.sumelectthermalfe: -1332.855063 hartree
dipole: 1.3026 -3.4248 0.5246
dipole: 3.7015
quadrupole: -102.1714 -173.6094 -153.8546
quadrupole: 2.6138 6.6554 -0.6608
quadrupole: 41.0404 -30.3976 -10.6428 2.6138 6.6554 -0.6608
hfenergy: -1333.1610255 hartree
pointgroup: C01 [X(C20H20N2O6)]
dipole: 0.4365556 1.1906852 0.7158651 debye
polarizability: 416.8566107|42.9233465|212.1912917|-12.8755011|10.8890287|226.6093299 unknown
InChI: InChI=1S/C20H20N2O6/c1-25-17-8-12-5-6-21-15(14(12)10-19(17)27-3)7-13-9-18(26-2)20(28-4)11-16(13)22(23)24/h5-6,8-11H,7H2,1-4H3
charge 0 multiplicity 1
48 atoms
O  -4.828543 -0.861234 1.994163
O  -6.299666 0.088122 -0.334151
O  4.399058 2.192427 2.068141
O  5.977824 0.401729 0.379954
O  2.582207 -2.64162 -1.651594
O  0.6002 -2.267353 -0.601956
N  0.076409 0.908466 -1.287835
N  1.845327 -1.978118 -0.813052
C  0.219686 -0.031847 0.98592
C  -0.596262 0.412005 -0.230634
C  -2.039332 0.305649 -0.206717
C  1.722286 0.004383 0.775244
C  -2.773887 0.745405 -1.374957
C  2.4657 -0.872216 -0.065784
C  -2.767872 -0.231753 0.901304
C  2.465294 1.002323 1.436879
C  -4.201921 0.668623 -1.375414
C  -4.15892 -0.323585 0.871567
C  -2.028537 1.262817 -2.483667
C  -4.892591 0.165449 -0.273799
C  3.863896 1.162972 1.303362
C  3.866568 -0.742869 -0.221859
C  4.583194 0.254243 0.457265
C  -0.639334 1.325291 -2.395751
C  -5.53399 -2.140396 1.731026
C  -7.018698 0.879535 0.694402
C  5.702344 2.813024 1.748065
C  6.704377 -0.54054 -0.479072
H  -0.098727 -1.052403 1.261307
H  -0.032195 0.63137 1.837005
H  -2.254032 -0.606084 1.790933
H  1.953284 1.723731 2.081063
H  -4.776231 1.018027 -2.239879
H  -2.546152 1.603466 -3.386481
H  4.360387 -1.457825 -0.883206
H  -0.034846 1.714423 -3.221838
H  -6.2780 -2.021431 0.923021
H  -6.02938 -2.401087 2.678375
H  -4.802553 -2.924033 1.458374
H  -8.084485 0.652085 0.542593
H  -6.836513 1.958578 0.531939
H  -6.698871 0.591081 1.711186
H  5.745469 3.107608 0.68538
H  6.532783 2.127892 1.975237
H  5.737767 3.703329 2.394217
H  6.376055 -0.456486 -1.532492
H  6.570977 -1.581806 -0.128906
H  7.761243 -0.249465 -0.392179
