program: Gaussian 09
title: 000286753
version: EM64L-G09RevD.01
frameworkgroup: C1[X(C10H7N3O3)]
method: RPBEPBE
basis: SDD
operation: Freq
keyword: #p
keyword: freq=noraman
keyword: PBEPBE/SDD
title: #p freq=noraman PBEPBE/SDD
converged: NO NO NO NO
title: Mulliken charges:
elementType: O O O N N N C C C C C C C C C C H H H H H H H
charge: -0.220979 -0.217319 -0.195877 0.048944 -0.031932 -0.050781 0.404531 -0.355804 0.272350 -0.296532 -0.305085 -0.252291 0.027037 -0.289893 -0.289046 -0.152532 0.273472 0.289111 0.295094 0.296399 0.255823 0.253714 0.241596
chargesum: 0.00000
title: Mulliken charges with hydrogens summed into heavy atoms:
elementType: O O O N N N C C C C C C C C C C
charge: -0.220979 -0.217319 -0.195877 0.048944 -0.031932 -0.050781 0.404531 -0.082333 0.272350 -0.007421 -0.009991 0.044107 0.027037 -0.034069 -0.035332 0.089064
polarizability: 3.66807143e+02 1.09827761e+01 1.51174934e+02 2.60975253e-02 6.06237830e-03 5.30841432e+01
1716.lowfreq: -7.2991 -6.5383 -3.0865 -0.0010 -0.0003 0.0004 38.7985 47.0104 48.5184
frequency: 38.7966 46.9953 48.5164 77.6808 130.2245 138.3718 178.3819 211.7408 235.2463 320.3469 344.5999 395.1076 410.7223 465.5303 499.6615 532.6419 563.8739 615.9668 623.2622 658.5198 679.5162 725.2593 765.2032 792.2787 802.9042 817.2074 856.1038 900.9537 908.9522 912.3406 924.4012 951.6441 962.0476 985.5793 997.0408 1025.7711 1053.0324 1074.3301 1130.5577 1165.0014 1199.7869 1221.3386 1249.6152 1271.1639 1277.6812 1294.7787 1311.5667 1342.5708 1372.1838 1399.9322 1402.9253 1489.2128 1517.0224 1532.2475 1544.2900 1641.4237 3135.2694 3139.7515 3140.1298 3165.0005 3183.6175 3232.8466 3261.8565
redmass: 5.9267 8.1587 7.5426 7.0669 6.7919 7.2880 5.2742 10.2292 3.0584 6.4985 3.6252 4.2200 9.0937 6.9058 2.7742 5.3155 5.2896 7.4621 7.8991 4.2421 8.5206 10.2772 6.5588 3.2023 1.2212 1.6080 4.5163 1.4695 9.0194 1.9090 6.3388 8.4299 1.3762 1.4563 1.0979 1.2455 2.6709 1.7182 3.8120 1.8249 1.8673 4.3751 4.5131 1.5970 1.6047 4.3397 3.1335 9.4659 3.1985 1.6534 2.9688 8.7743 5.4672 4.3799 6.2316 6.5864 1.0908 1.0922 1.0923 1.0907 1.0991 1.0961 1.1031
irintensity: 0.1229 1.5589 1.0189 5.4028 0.1761 2.2971 0.0268 0.8017 3.3079 1.5993 1.5518 0.0001 5.0058 3.8005 5.9561 3.4562 0.7165 11.2616 5.9727 0.7955 11.2448 17.9627 0.7818 7.4244 5.8296 95.7923 0.3625 1.8419 13.8435 2.4680 0.1717 5.8988 0.0008 2.9180 60.4391 31.9804 3.6114 1.0913 72.5127 6.2914 27.3012 470.6644 0.3364 27.8126 28.1477 93.6718 1.3739 94.7378 37.1952 5.9401 133.0614 298.5646 40.2141 107.1313 42.1781 1.4987 26.8318 0.0617 20.9377 5.3222 21.7662 0.5665 4.8035
temp: 298.150 k
press: 1.00000 atm
elementType: 8 8 8 7 7 7 6 6 6 6 6 6 6 6 6 6 1 1 1 1 1 1 1
symmnumber: 1
zpe: 414461.3 jmol-1
zpe.correction: 0.157860 hartree
zpe.thermalcorrener: 0.170916 hartree
zpe.thermalcorrenthalpy: 0.171860 hartree
zpe.thermalcorrgfe: 0.116041 hartree
zpe.sumelectzpe: -773.934735 hartree
zpe.sumelectthermal: -773.921679 hartree
zpe.sumelectthermalent: -773.920735 hartree
zpe.sumelectthermalfe: -773.976555 hartree
dipole: -6.5910 4.8335 -0.0067
dipole: 8.1734
quadrupole: -84.7346 -90.0972 -92.7909
quadrupole: 15.8596 -0.0391 0.0126
quadrupole: 4.4730 -0.8896 -3.5833 15.8596 -0.0391 0.0126
hfenergy: -774.0925952 hartree
pointgroup: C01 [X(C10H7N3O3)]
dipole: -2.5822248 -1.9162737 0.0194694 debye
dipolederiv: -0.0660601 0.0922809 -0.0006962 0.0719608 -0.4991938 0.0020262 -0.0009485 0.0015695 -0.0846422 -1.3454908 -0.0499258 0.0015928 0.0366272 -0.4245114 0.0016275 0.0064759 0.0010699 -0.2436866 -0.3822702 0.0601819 0.0007612 -0.4616076 -0.8405139 0.0033468 0.0046015 0.0058984 -0.2195036 2.1094284 0.3030003 -0.0061039 1.1870267 1.4035193 -0.0096307 -0.0154283 -0.008871 0.2043622 -0.9302415 0.0926231 0.0009334 0.4345449 -0.4039818 0.0002365 -0.0011325 0.0009332 -0.2076353 -0.9528803 0.0349355 0.0013484 -0.4228786 -0.3283643 0.0016202 0.003946 0.0007014 -0.1938225 0.5703496 -0.0069051 -0.0008069 -0.3905285 0.1654532 0.0007279 0.0005856 -0.0003807 0.0971124 -0.5631407 -0.1183891 0.0016148 0.2747378 0.0557082 -0.0018511 -0.0010981 -0.0009896 -0.1934958 -0.889409 -0.248877 0.0037959 -1.1451323 -0.3375488 0.0055715 0.0090842 0.0027239 0.0920382 -0.0010908 -0.0695936 0.0001966 0.181172 0.1102355 -0.0016455 -0.0012261 -0.0011277 -0.1229341 0.3396382 0.0930727 -0.001403 0.3200821 0.2133017 -0.002672 -0.0037847 -0.0024073 -0.1177835 -0.4117214 0.1191163 -0.0000867 0.2154164 -0.0267239 -0.0009651 -0.0008094 -0.0008258 -0.1319659 1.5979002 -0.2037702 -0.0019028 -0.0646287 0.2110126 -0.000545 -0.0025398 -0.0002844 0.0954362 0.4781102 -0.0085347 -0.0009718 -0.3197014 0.4434065 -0.0020165 0.0008629 -0.0026676 -0.0273047 0.4365144 -0.0463298 -0.0006712 0.3329279 0.4148469 -0.0031741 -0.0029077 -0.0024074 -0.0238239 -0.2074527 0.0204069 0.0001775 -0.0360498 -0.4281693 0.0021361 0.0005159 0.0020258 -0.0645279 0.1040602 -0.0595913 0.000545 -0.0544107 0.0308852 0.0009589 0.0008625 0.0010244 0.1961429 0.1017921 -0.0211748 0.0002359 -0.0522977 0.0252004 0.0008534 0.000706 0.0008186 0.1659763 0.0646203 0.0269518 0.0001294 -0.0044615 0.1383816 0.0003456 0.0003395 0.0003028 0.2004192 0.0407174 -0.0202298 0.000361 -0.1003942 0.0430792 0.0009164 0.0008617 0.0007791 0.1712966 0.0087463 0.0780494 -0.0002149 0.1339491 -0.0390948 0.0006387 -0.0005359 0.0007502 0.1209724 -0.0005552 -0.0708109 0.0006407 -0.1361624 -0.0361402 0.0011507 0.0010228 0.0010234 0.1175232 -0.1015647 0.0035133 0.000525 -0.0001913 0.1092118 0.0003436 0.0005467 0.0003409 0.1698464 unknown
polarizability: 366.9235655|-9.7602993|151.0538562|-0.6188517|-0.5601701|53.0887985 unknown
InChI: InChI=1S/C10H7N3O3/c14-13(15)10-5-3-8(16-10)2-4-9-11-6-1-7-12-9/h1-7H
charge 0 multiplicity 1
23 atoms
O  1.827495 0.246024 -0.012753
O  5.397297 0.554797 -0.025821
O  3.750958 2.165697 -0.031064
N  4.152823 0.936603 -0.020144
N  -3.16421 1.440849 -0.010508
N  -3.19948 -1.008051 0.003497
C  1.105895 -0.973648 -0.005038
C  2.018213 -2.044346 -0.000984
C  3.177229 -0.110359 -0.013093
C  -0.32974 -0.92914 -0.002686
C  3.336651 -1.495116 -0.006317
C  -1.081566 0.220031 -0.007589
C  -2.545651 0.208119 -0.004724
C  -4.527811 1.438904 -0.007764
C  -4.558148 -0.971189 0.005982
C  -5.284326 0.244779 0.000547
H  1.748882 -3.098251 0.005068
H  -0.849535 -1.894534 0.00355
H  4.287746 -2.020034 -0.005245
H  -0.614785 1.210415 -0.013922
H  -5.010005 2.422709 -0.012389
H  -5.069232 -1.940562 0.012537
H  -6.377001 0.257804 0.00266
