program: Gaussian 09
title: 000286752
version: EM64L-G09RevD.01
frameworkgroup: C1[X(C9H6N2O3S)]
method: RPBEPBE
basis: SDD
operation: Freq
keyword: #p
keyword: freq=noraman
keyword: PBEPBE/SDD
title: #p freq=noraman PBEPBE/SDD
converged: NO YES NO NO
title: Mulliken charges:
elementType: S O O O N N C C C C C C C C C H H H H H H
charge: 0.283393 -0.230952 -0.218206 -0.201267 -0.047288 0.048601 0.407077 -0.356828 -0.305543 0.272229 -0.303790 -0.134470 -0.204488 -0.486731 -0.195940 0.273305 0.285162 0.294803 0.279832 0.276139 0.264961
chargesum: 0.00000
title: Mulliken charges with hydrogens summed into heavy atoms:
elementType: S O O O N N C C C C C C C C C
charge: 0.283393 -0.230952 -0.218206 -0.201267 -0.047288 0.048601 0.407077 -0.083523 -0.020381 0.272229 -0.008987 0.145362 -0.204488 -0.210591 0.069021
polarizability: 3.94046840e+02 -9.30769445e+00 1.56040933e+02 -1.90137320e-03 1.99817497e-03 5.12679763e+01
1716.lowfreq: -7.4734 -4.5534 -1.3467 -0.0008 0.0011 0.0018 38.1171 47.0060 47.8249
frequency: 38.0945 46.9958 47.8165 83.3207 136.2014 142.4813 176.2232 207.9056 274.6949 284.5472 344.8033 408.3762 443.1317 498.7984 515.9980 561.3975 573.3816 619.1213 647.8143 662.4112 677.2461 717.0092 736.8123 740.3941 807.5165 825.4822 849.7236 878.5458 881.2812 904.7771 906.5519 924.0500 968.2478 1002.4428 1025.9917 1069.3558 1129.9562 1180.6780 1216.5075 1229.8433 1267.2593 1286.2357 1293.1952 1301.6908 1344.5542 1371.7988 1413.7547 1460.1445 1503.1325 1546.9813 1622.1407 3144.3223 3154.2010 3202.1259 3231.0783 3253.8970 3259.4315
redmass: 8.7135 9.4804 9.0978 6.3793 7.7973 6.8294 4.6128 11.1622 7.9621 2.8252 4.8052 9.3593 6.9534 4.1160 6.6258 5.4185 8.2483 5.2469 9.1336 4.8371 8.4193 8.5513 10.5169 1.2228 1.3141 5.1630 5.3002 1.3361 1.8655 1.4026 9.2903 6.2941 1.0960 3.2965 1.2667 1.2875 4.0919 1.9811 3.2890 2.1170 1.7904 3.3110 2.1638 1.8919 9.5186 3.6587 5.4152 5.5245 8.4808 6.8022 6.0659 1.0954 1.0875 1.0926 1.0960 1.1002 1.1032
irintensity: 2.6308 1.6523 0.1224 4.0368 0.5785 0.0134 0.0759 2.2095 0.8765 1.7380 2.4524 3.4910 7.1365 6.3878 3.2512 0.6707 0.2318 7.0817 6.8131 2.3355 7.4771 27.5103 22.4829 81.0883 54.4083 32.5140 3.7948 3.8941 3.5009 4.0110 9.4847 0.1486 65.4397 68.3882 25.7381 0.7821 107.4083 9.0823 294.8286 190.1911 56.3636 89.2645 18.6525 25.4440 110.3372 9.4992 150.0271 49.9675 169.9501 10.5564 43.4464 0.9495 4.0397 10.9227 0.5916 1.5578 5.1199
temp: 298.150 k
press: 1.00000 atm
elementType: 16 8 8 8 7 7 6 6 6 6 6 6 6 6 6 1 1 1 1 1 1
symmnumber: 1
zpe: 359130.1 jmol-1
zpe.correction: 0.136785 hartree
zpe.thermalcorrener: 0.149646 hartree
zpe.thermalcorrenthalpy: 0.150590 hartree
zpe.thermalcorrgfe: 0.095063 hartree
zpe.sumelectzpe: -1078.599662 hartree
zpe.sumelectthermal: -1078.586801 hartree
zpe.sumelectthermalent: -1078.585857 hartree
zpe.sumelectthermalfe: -1078.641384 hartree
dipole: 5.3052 3.9253 -0.0019
dipole: 6.5995
quadrupole: -94.6477 -91.3327 -95.3202
quadrupole: -18.6076 0.0097 0.0029
quadrupole: -0.8808 2.4342 -1.5534 -18.6076 0.0097 0.0029
hfenergy: -1078.736447 hartree
pointgroup: C01 [X(C9H6N2O3S1)]
dipole: -2.1592451 -1.4419218 0.0009165 debye
dipolederiv: 0.2329324 -0.0515167 -0.0001621 0.2190768 -0.4604661 -0.0009202 -0.0000146 -0.0004365 0.1563089 -0.0610373 0.0772809 0.0000845 0.0153984 -0.4949937 -0.0004376 0.0000567 -0.0004402 -0.0878672 -1.4520931 -0.0437507 0.0019696 0.0547782 -0.4158939 -0.0004085 0.0007487 -0.0001187 -0.2442785 -0.3501352 0.0718196 0.000096 -0.5645761 -0.8368819 0.0004338 -0.0009498 -0.001321 -0.2235407 0.0776985 -0.173533 -0.0005434 -0.0145863 -0.6680902 -0.0004337 -0.0004476 -0.0002331 -0.1776696 2.2221988 0.275126 -0.0026189 1.3328042 1.3707453 -0.000677 -0.0001114 0.0012072 0.2039169 0.8922913 -0.0411929 -0.0012874 -0.4114218 0.1583426 0.0006311 -0.0015465 0.0001438 0.0945735 -0.7024766 -0.1057554 0.0006112 0.329771 0.0394941 -0.0002715 0.0012179 0.0003882 -0.1965015 -0.3960466 -0.0191064 0.0003801 0.4763485 0.090048 -0.0005046 0.0009225 0.0002499 -0.1258115 -0.9652285 -0.1989324 0.0012769 -1.2755423 -0.3291577 0.0013195 -0.0000301 -0.0001271 0.0861779 0.4060306 0.0900657 -0.0007088 0.4129224 0.219635 -0.0002267 -0.000136 0.0002912 -0.1156838 0.4196092 -0.0106952 -0.0008289 0.0472468 -0.0828907 -0.0000455 -0.0006433 0.0000267 -0.1064864 0.1197072 -0.1699716 -0.0004107 -0.5482793 0.8280774 0.0016581 -0.0008602 0.00114 -0.0609096 -0.4866778 0.2573054 0.0004589 -0.5645544 0.1952306 0.0013458 -0.0002299 0.0000427 -0.3071176 -0.2832862 0.1194191 0.000442 0.7712728 0.0220146 -0.0010868 0.0011369 -0.0001048 -0.0593484 0.1017538 -0.0590529 0.000078 -0.0508277 0.0319306 -0.0000862 0.0000153 -0.0000858 0.1969944 0.0515227 -0.0301191 0.000157 -0.0489843 0.0312908 -0.0000707 0.000061 -0.0001 0.1721681 0.0665548 0.0275441 0.0002353 -0.0067881 0.1387534 -0.0000551 0.0001846 -0.0001071 0.2003723 0.0472221 -0.0048155 0.0001908 -0.0754055 0.0203586 -0.0000452 0.0001337 -0.0001573 0.174606 0.0445521 0.0224834 0.0003301 0.0083995 0.1021306 -0.0001381 0.0003043 -0.0001615 0.2312295 0.0149078 -0.0326024 0.0002497 -0.1070525 0.0403227 0.0000191 0.0001879 -0.0000964 0.1888673 unknown
polarizability: 392.5969677|-20.7220185|157.4898322|-0.5372377|0.1483889|51.2689495 unknown
InChI: InChI=1S/C9H6N2O3S/c12-11(13)9-4-2-7(14-9)1-3-8-10-5-6-15-8/h1-6H
charge 0 multiplicity 1
21 atoms
S  -3.73278 1.825982 0.002135
O  1.52421 0.232683 -0.007596
O  5.093581 0.565737 -0.011752
O  3.434186 2.163393 -0.007675
N  -3.616339 -0.849124 -0.000612
N  3.847082 0.937762 -0.010636
C  0.807144 -0.989965 -0.007725
C  1.724845 -2.057341 -0.010251
C  -0.62623 -0.945603 -0.00541
C  2.877965 -0.117831 -0.010139
C  3.04113 -1.50174 -0.011789
C  -1.367703 0.217132 -0.003018
C  -2.811172 0.217976 -0.000757
C  -5.238058 0.868289 0.00374
C  -4.960046 -0.495837 0.001863
H  1.462086 -3.113177 -0.010908
H  -1.146005 -1.909901 -0.005602
H  3.993496 -2.024846 -0.013846
H  -0.854342 1.185213 -0.002828
H  -6.207157 1.361696 0.005816
H  -5.715491 -1.282299 0.002285
