program: Gaussian 09
title: 000286788
version: EM64L-G09RevD.01
frameworkgroup: C1[X(C17H14ClN3O3)]
method: RPBEPBE
basis: SDD
operation: Freq
keyword: #p
keyword: freq=noraman
keyword: PBEPBE/SDD
title: #p freq=noraman PBEPBE/SDD
converged: NO YES NO NO
title: Mulliken charges:
elementType: Cl O O O N N N C C C C C C C C C C C C C C C C C H H H H H H H H H H H H H H
charge: -0.035133 -0.179287 -0.168621 -0.162977 -0.288753 -0.206474 0.098806 -0.028747 0.102200 0.437863 0.435232 0.253074 -0.312409 -0.341340 -0.339274 -0.390190 -0.389156 -0.582326 -0.248550 -0.234715 -0.239002 -0.234068 -0.237482 -0.238989 0.268023 0.271521 0.266785 0.263749 0.240393 0.245323 0.292353 0.279679 0.234038 0.232546 0.232072 0.233311 0.235526 0.234999
chargesum: 0.00000
title: Mulliken charges with hydrogens summed into heavy atoms:
elementType: Cl O O O N N N C C C C C C C C C C C C C C C C C
charge: -0.035133 -0.179287 -0.168621 -0.162977 -0.288753 -0.206474 0.098806 -0.028747 0.102200 0.437863 0.435232 0.253074 0.227134 -0.074555 -0.075525 -0.149797 -0.143833 -0.010294 -0.014512 -0.002169 -0.006930 -0.000757 -0.001956 -0.003990
polarizability: 2.44379387e+02 3.50345869e+00 2.17977237e+02 1.83604908e+00 -1.24112580e+01 1.96081040e+02
1716.lowfreq: -7.7623 -0.0009 -0.0003 0.0007 2.0695 8.7088 22.5855 25.5853 29.8755
frequency: 22.4713 25.4979 29.7815 43.8658 60.7027 65.2408 68.7450 76.1798 87.5397 126.3384 148.1767 175.0436 203.5260 220.1016 227.3973 237.0417 271.9088 272.1645 295.7206 309.0967 321.0225 357.4226 374.4092 399.0637 403.7096 428.4237 487.7400 513.8254 579.2727 594.4094 614.3171 616.6390 619.0867 662.0064 688.3538 697.4037 703.0049 704.6451 730.0407 750.0401 764.3810 768.6590 821.9178 842.5136 850.2144 855.2142 872.8425 906.7869 929.9747 933.0013 977.5162 981.5802 982.8601 990.2462 992.9344 999.4728 1001.0360 1026.5321 1030.8721 1039.0550 1056.6612 1077.4252 1090.8020 1091.5998 1115.2125 1127.0921 1177.0150 1177.4646 1189.0274 1198.6486 1201.3997 1212.0882 1236.6923 1267.8377 1317.8165 1324.6620 1330.6438 1335.8642 1371.4442 1377.6439 1382.3782 1410.9180 1435.0213 1438.6387 1447.8522 1459.4828 1481.6764 1485.1186 1590.8915 1594.1169 1607.7476 1611.0571 1645.1049 1696.1075 3041.5379 3066.7193 3109.9732 3131.1514 3131.4660 3139.9437 3140.5175 3151.5439 3152.6283 3154.9950 3161.0498 3161.5919 3171.8928 3172.3030
redmass: 6.2414 5.5084 4.8130 4.3727 9.3487 5.8068 2.8372 6.4606 6.2931 7.0524 10.9456 8.1185 8.4852 6.3665 7.0156 5.0672 4.0803 4.9108 6.3533 5.5667 7.4366 10.4561 8.4866 2.7894 2.8288 9.0147 3.7807 3.9785 10.3160 7.2071 6.4431 6.5884 9.0867 6.6296 5.9541 2.1618 3.9566 2.0908 7.2805 1.9692 1.7779 1.5660 2.8619 4.2566 1.3211 1.3103 4.6252 4.6007 1.4781 1.7709 1.4278 1.5712 2.0143 5.9191 5.2837 1.3230 1.3252 2.7216 2.2420 3.1513 2.8904 4.7502 1.6688 1.6504 2.5733 5.4747 1.0518 1.0550 4.3223 1.1405 1.2307 3.1965 1.7755 1.1733 2.8756 1.3435 1.3184 1.6166 1.4306 7.0577 8.8281 12.7311 2.2364 2.2386 1.0831 1.0981 2.1495 2.1619 6.0068 6.1911 5.9511 5.9449 12.5528 11.7581 1.0591 1.0558 1.1066 1.0851 1.0851 1.0883 1.0883 1.0929 1.0926 1.1127 1.0959 1.0961 1.1012 1.1008
irintensity: 0.0765 0.1080 0.1111 0.0827 0.0563 0.3779 1.4134 0.4513 1.5992 4.7838 4.4865 1.6094 3.0783 0.2866 0.4274 0.8019 4.9779 0.5491 1.9749 1.4800 11.4973 13.2883 12.6121 0.0594 0.1614 7.7769 10.5738 13.7420 20.1466 12.6345 0.8955 3.8168 18.1402 6.7196 6.0076 31.0762 15.7573 42.0052 52.8679 87.5740 19.2340 29.0272 4.4276 126.9799 11.6401 7.4049 16.7907 7.4475 3.9567 0.2905 0.5465 1.0937 1.8794 2.8714 2.5171 0.0337 0.3604 0.3402 12.1518 31.9765 18.3668 221.1924 15.1310 37.7145 147.0904 40.8776 0.0313 0.0374 3.3204 2.7295 0.7277 31.6548 16.8036 17.8575 189.4022 6.3145 2.4754 72.7327 65.3625 2.8624 0.2568 78.4169 15.7311 7.7814 19.3869 15.9859 17.6681 16.1978 0.6710 0.4238 2.8882 2.1232 482.1438 62.1428 2.7052 14.6627 0.1663 0.3628 0.2970 3.9970 3.4751 23.5089 20.6175 3.5520 20.8919 19.6835 13.8298 10.1479
temp: 298.150 k
press: 1.00000 atm
elementType: 17 8 8 8 7 7 7 6 6 6 6 6 6 6 6 6 6 6 6 6 6 6 6 6 1 1 1 1 1 1 1 1 1 1 1 1 1 1
symmnumber: 1
zpe: 731094.5 jmol-1
zpe.correction: 0.278459 hartree
zpe.thermalcorrener: 0.299964 hartree
zpe.thermalcorrenthalpy: 0.300908 hartree
zpe.thermalcorrgfe: 0.224831 hartree
zpe.sumelectzpe: -1504.451635 hartree
zpe.sumelectthermal: -1504.430129 hartree
zpe.sumelectthermalent: -1504.429185 hartree
zpe.sumelectthermalfe: -1504.505263 hartree
dipole: -3.2823 0.5468 -2.5612
dipole: 4.1991
quadrupole: -148.0870 -126.0927 -165.9761
quadrupole: 3.6486 2.6470 -1.8164
quadrupole: -1.3684 20.6259 -19.2575 3.6486 2.6470 -1.8164
hfenergy: -1504.7300937 hartree
pointgroup: C01 [X(C17H14Cl1N3O3)]
dipole: -1.377613 0.4771197 -0.7770677 debye
polarizability: 244.1204962|-0.3822322|220.6142265|-5.9686566|-9.0741148|193.7029408 unknown
InChI: InChI=1S/C17H14ClN3O3/c18-11-12-20-15(22)17(21(19-24)16(20)23,13-7-3-1-4-8-13)14-9-5-2-6-10-14/h1-10H,11-12H2
charge 0 multiplicity 1
38 atoms
Cl 5.844951 -0.491696 -1.782306
O  0.838996 0.046483 -2.244547
O  2.609407 -1.200799 1.916569
O  0.310933 -0.504022 3.569829
N  0.428918 -0.349248 1.293911
N  1.990171 -0.677614 -0.31779
N  -0.314453 -0.208895 2.516454
C  -0.270405 0.039551 0.0208
C  0.881487 -0.168927 -1.01399
C  -0.745139 1.505576 0.082659
C  -1.39691 -0.953976 -0.345222
C  1.773872 -0.792097 1.089477
C  3.257383 -1.078437 -0.953651
C  -1.943135 1.807835 0.779054
C  -2.23451 -0.638623 -1.444726
C  0.009776 2.560397 -0.484742
C  -1.564994 -2.187719 0.327361
C  4.259618 0.088253 -0.952807
C  -2.374823 3.143634 0.907083
C  -3.237382 -1.54094 -1.855124
C  -0.424784 3.899021 -0.355644
C  -2.574844 -3.087528 -0.083854
C  -1.616118 4.195562 0.34228
C  -3.414033 -2.768216 -1.174033
H  3.671328 -1.932272 -0.391619
H  3.032425 -1.388571 -1.987541
H  -2.533794 0.998378 1.218367
H  -2.094468 0.306824 -1.978594
H  0.922327 2.350849 -1.052247
H  -0.92408 -2.456222 1.172747
H  4.541751 0.392235 0.065282
H  3.902087 0.94369 -1.543774
H  -3.30033 3.364115 1.449725
H  -3.879194 -1.287311 -2.705686
H  0.164164 4.706113 -0.804598
H  -2.703289 -4.035466 0.449785
H  -1.952765 5.233324 0.441388
H  -4.19524 -3.46766 -1.491075
