program: Gaussian 09
title: 000286756
version: EM64L-G09RevD.01
frameworkgroup: C1[X(C15H22O4)]
method: RPBEPBE
basis: SDD
operation: Freq
keyword: #pfreq=noraman
keyword: PBEPBE/SDD
title: #p freq=noraman PBEPBE/SDD
converged: YES YES NO NO
title: Mulliken charges:
elementType: O O O O C C C C C C C C C C C C C C C H H H H H H H H H H H H H H H H H H H H H H
charge: -0.244650 -0.456203 -0.199664 -0.435856 -0.183936 -0.175200 -0.433074 -0.101275 -0.456335 0.602350 -0.518295 -0.316192 0.306078 -0.755048 -0.453664 0.080263 -0.058814 -0.690420 -0.711578 0.251501 0.219974 0.219801 0.203801 0.246746 0.210056 0.211592 0.256631 0.224367 0.265989 0.212580 0.208437 0.177374 0.241674 0.229979 0.228088 0.257400 0.338719 0.224873 0.199581 0.247514 0.324836
chargesum: 0.00000
title: Mulliken charges with hydrogens summed into heavy atoms:
elementType: O O O O C C C C C C C C C C C C C C C
charge: -0.244650 -0.117483 -0.199664 -0.111019 0.067564 0.044774 -0.009472 0.145471 -0.034687 0.602350 -0.261664 -0.091825 0.306078 -0.068042 -0.034616 0.080263 0.171165 -0.204933 -0.039610
polarizability: 2.10998954e+02 -1.37285097e+01 1.54848892e+02 1.02000443e+01 9.90955436e+00 1.47814384e+02
1716.lowfreq: -8.6215 -0.0007 -0.0006 -0.0001 8.0841 11.3289 26.4971 33.7422 40.1905
frequency: 25.9804 33.6955 40.0363 66.5684 81.8683 110.0459 143.8648 148.0377 174.9854 190.9218 212.5575 223.9446 231.7574 249.4539 251.1532 268.8642 276.4917 292.3272 307.0081 327.7011 333.5707 344.0505 371.3042 407.1575 422.3493 444.6876 474.7274 502.5875 515.8819 563.5894 604.1434 606.3503 632.7304 658.0820 682.4693 738.0952 781.2884 785.3780 815.1573 822.0167 830.5439 869.0235 886.9636 893.8509 918.3841 933.1016 952.7048 956.9446 978.1061 988.8003 1002.1767 1022.0938 1028.6955 1029.9835 1035.8187 1068.6517 1099.7437 1107.0424 1110.3025 1137.0379 1145.1359 1157.5457 1178.1402 1183.2827 1208.7309 1216.3849 1240.3112 1245.8469 1252.0015 1274.2355 1290.0488 1294.2019 1306.8284 1318.4758 1328.3215 1333.7600 1342.3496 1349.8618 1353.7327 1370.6273 1373.1968 1387.8965 1390.2451 1394.1752 1418.7789 1456.2927 1458.5787 1466.8167 1466.9539 1473.0990 1475.6705 1490.3406 1676.7339 1681.0708 1691.5881 2940.9745 2943.1684 2964.3264 2966.7969 2970.1444 2972.0869 2979.0699 2982.9104 2999.2052 3020.8537 3038.0316 3038.7575 3049.0381 3069.4040 3070.1321 3092.4357 3098.0265 3098.3349 3113.5370 3206.1294 3544.1872 3553.3755
redmass: 3.6400 4.6493 4.4035 4.2444 3.9445 4.2234 3.1470 5.1786 4.7173 2.8346 2.3035 1.4111 1.2961 2.4630 1.8383 1.6969 1.8974 3.0774 1.5002 2.7485 3.2099 3.1058 2.5339 3.0873 3.3086 3.3451 3.1031 3.4563 3.9599 3.2749 2.3474 3.0511 3.3149 3.0801 3.3564 3.3068 2.4206 2.4465 2.6507 2.3263 1.8870 1.8905 1.8144 2.0216 2.4402 3.4118 3.3547 3.6341 1.3785 1.7416 1.9560 2.1656 1.8396 1.9386 3.8730 2.1684 2.2995 2.1142 2.3573 2.1225 2.1577 1.7406 1.4882 1.3831 1.2066 1.2715 1.9903 1.3631 1.3600 1.2131 1.3209 1.2742 1.3519 1.3430 1.3450 1.6132 1.4363 1.4831 1.6362 1.2267 1.3277 1.4279 1.2367 1.3879 1.1733 1.0846 1.0797 1.0856 1.0550 1.0530 1.0485 1.0575 7.4132 7.4250 11.2066 1.0673 1.0806 1.0610 1.0781 1.0824 1.0445 1.0446 1.0554 1.0830 1.0995 1.1019 1.0872 1.0933 1.0987 1.0957 1.0988 1.0619 1.0990 1.0906 1.1153 1.0659 1.0660
irintensity: 1.5490 0.3980 5.4472 0.4099 0.2650 1.5076 1.7292 3.5561 3.4649 0.5093 1.4468 6.2214 0.0485 0.0496 52.9857 62.0546 14.3268 4.4571 90.0263 34.5835 17.0302 1.6907 2.0321 3.5482 5.5994 5.4387 1.1448 0.8376 5.3309 7.7065 1.8075 16.8770 4.5994 4.6489 7.9009 6.6448 30.2587 13.8742 7.9632 25.5703 4.0600 14.1213 21.5629 41.8986 18.7010 90.1158 39.9315 16.6602 53.0150 2.6403 32.5066 6.1762 77.0042 41.2451 149.4154 16.7495 22.5187 34.7955 13.6569 52.3645 2.9272 11.4033 0.5198 9.4295 23.4130 15.5705 55.8221 15.8441 8.3631 2.4207 3.3217 1.2017 12.4313 14.0771 10.6398 3.8305 3.9735 0.6135 6.7830 12.3266 15.0775 8.9938 33.1472 25.0749 27.0302 2.8030 5.6369 14.3191 3.0636 5.3106 20.3233 8.7033 58.9389 4.9005 254.8935 47.4210 2.2174 24.0421 18.1498 20.7964 43.5977 14.9496 49.3448 21.8945 39.4658 49.2200 5.6613 22.9681 43.2326 70.8394 22.4945 3.7840 15.9225 9.4834 3.4815 3.8960 4.2818
temp: 298.150 k
press: 1.00000 atm
elementType: 8 8 8 8 6 6 6 6 6 6 6 6 6 6 6 6 6 6 6 1 1 1 1 1 1 1 1 1 1 1 1 1 1 1 1 1 1 1 1 1 1
symmnumber: 1
zpe: 899681.7 jmol-1
zpe.correction: 0.342671 hartree
zpe.thermalcorrener: 0.362636 hartree
zpe.thermalcorrenthalpy: 0.363580 hartree
zpe.thermalcorrgfe: 0.294188 hartree
zpe.sumelectzpe: -884.167828 hartree
zpe.sumelectthermal: -884.147862 hartree
zpe.sumelectthermalent: -884.146918 hartree
zpe.sumelectthermalfe: -884.216311 hartree
dipole: -4.9434 2.2783 2.0477
dipole: 5.8156
quadrupole: -110.0831 -120.4977 -122.4635
quadrupole: 16.8394 18.3720 2.6182
quadrupole: 7.5983 -2.8162 -4.7821 16.8394 18.3720 2.6182
hfenergy: -884.5104982 hartree
pointgroup: C01 [X(C15H22O4)]
dipole: 2.011349 0.823541 -0.7151042 debye
polarizability: 210.8407004|12.2115107|153.8638488|12.7582481|-9.7260218|148.9576811 unknown
InChI: InChI=1S/C15H22O4/c1-8-4-5-11-10(3)15(18)19-14(11)7-12(8)13(17)6-9(2)16/h7-9,11,13-14,16-17H,3-6H2,1-2H3
charge 0 multiplicity 1
41 atoms
O  -2.233199 -0.819041 1.338942
O  3.224351 1.47262 1.548157
O  -4.34791 -1.678313 0.846765
O  3.56509 -2.133273 -1.828535
C  -1.650597 0.146251 -0.803149
C  1.079593 1.846378 -0.329929
C  -1.2513 1.423559 -1.560965
C  -1.341183 0.221597 0.718265
C  0.284924 1.610817 -1.653728
C  1.156032 0.646524 0.627628
C  0.086438 -0.042366 1.11117
C  2.552237 0.234255 1.082897
C  -3.113651 -0.265229 -0.793278
C  0.609965 3.117353 0.43437
C  3.39257 -0.422779 -0.047225
C  -3.367314 -0.999416 0.497836
C  2.826424 -1.750258 -0.603109
C  -4.084159 -0.078604 -1.719632
C  2.821508 -2.903973 0.414973
H  -1.0632 -0.704241 -1.212992
H  2.120425 2.060268 -0.641595
H  -1.725613 2.30353 -1.08365
H  -1.652145 1.374617 -2.592544
H  -1.693575 1.197056 1.113708
H  0.71782 0.732914 -2.175993
H  0.479712 2.48759 -2.303581
H  0.225615 -0.844161 1.84853
H  2.465819 -0.473511 1.933803
H  1.303739 3.323926 1.266074
H  0.602051 3.992037 -0.243342
H  -0.405136 3.008121 0.856231
H  4.417619 -0.611871 0.34501
H  3.492871 0.289107 -0.887952
H  1.801911 -1.580264 -0.976645
H  -3.901236 0.455619 -2.658372
H  -5.093142 -0.467642 -1.540586
H  4.17511 1.267295 1.73892
H  2.129944 -2.703223 1.253582
H  3.832415 -3.065352 0.839587
H  2.496573 -3.836505 -0.077536
H  4.494402 -2.370215 -1.575109
