program: Gaussian 09
title: 000027686
version: EM64L-G09RevD.01
frameworkgroup: C1[X(C23H16O11)]
method: RPBEPBE
basis: SDD
operation: Freq
keyword: #p
keyword: freq=noraman
keyword: PBEPBE/SDD
title: #p freq=noraman PBEPBE/SDD
converged: YES YES NO NO
title: Mulliken charges:
elementType: O O O O O O O O O O O C C C C C C C C C C C C C C C C C C C C C C C H H H H H H H H H H H H H H H H
charge: -0.258743 -0.323098 -0.446371 -0.225937 -0.222101 -0.255586 -0.237362 -0.393684 -0.395560 -0.215683 -0.219970 -0.138324 -0.320778 -0.352744 0.298754 0.049708 0.417834 0.211172 0.217001 -0.549683 0.184802 -0.381140 0.185377 -0.312812 -0.387985 -0.368939 -0.194500 0.147956 -0.382871 0.203728 -0.389023 0.202736 0.121678 0.119426 0.242893 0.236419 0.233391 0.301217 0.237042 0.296515 0.258426 0.280226 0.275356 0.271317 0.241441 0.360950 0.295615 0.294498 0.395263 0.392151
chargesum: 0.00000
title: Mulliken charges with hydrogens summed into heavy atoms:
elementType: O O O O O O O O O O O C C C C C C C C C C C C C C C C C C C C C C C
charge: -0.258743 -0.323098 -0.085421 -0.225937 -0.222101 -0.255586 -0.237362 0.001580 -0.003409 -0.215683 -0.219970 0.104568 0.149032 0.185515 0.298754 0.049708 0.417834 0.211172 0.217001 -0.253168 0.184802 -0.122714 0.185377 -0.032585 -0.112629 -0.097622 0.046941 0.147956 -0.087257 0.203728 -0.094525 0.202736 0.121678 0.119426
polarizability: 3.27107734e+02 1.05012770e+01 3.59723770e+02 2.71412794e+00 -3.28893800e+01 2.41028171e+02
1716.lowfreq: -6.9174 -3.1740 -0.0007 -0.0004 0.0003 2.5590 7.2198 12.7452 16.4934
frequency: 6.9706 12.6430 16.4704 32.1880 44.7222 51.1831 53.4095 59.5748 68.4612 83.0687 94.2961 110.9447 128.2141 138.7653 145.7685 155.1267 172.3817 174.0422 179.0455 200.2867 223.1085 233.4432 243.9203 244.8122 273.4790 297.8427 308.7640 348.8469 358.1831 373.6564 384.0992 411.7545 418.7150 424.3698 451.9232 461.1704 467.3611 481.9030 489.9005 495.1041 497.7346 506.9162 520.2287 532.6031 550.3014 558.0888 577.6574 590.9669 601.6867 609.7765 623.7890 629.3387 634.4038 652.1622 665.7482 683.1670 698.5543 729.5139 735.1269 735.2733 760.7061 762.1303 779.2128 785.1416 801.3910 827.8712 851.1412 873.6276 877.9075 898.0263 900.6316 907.3052 909.6653 912.0121 919.7362 935.0768 958.4162 963.4505 976.4349 1003.0194 1006.5246 1017.0749 1040.1760 1058.9385 1059.6375 1087.3262 1101.3417 1114.8003 1125.9336 1130.1740 1142.4267 1175.2147 1179.5761 1185.3686 1214.5076 1220.8369 1233.2960 1243.1878 1256.0157 1260.0341 1264.4769 1271.8932 1303.8016 1304.7945 1332.0775 1357.0380 1361.8150 1364.8705 1380.2008 1387.2210 1398.7323 1404.7343 1422.9907 1442.5410 1448.0839 1460.2248 1469.3658 1476.9352 1539.2661 1552.5075 1567.4414 1576.4068 1601.8171 1604.3368 1624.1035 1625.3459 1636.3772 1636.4718 2988.9406 2996.2284 3054.7878 3073.6475 3078.3380 3152.5420 3165.6376 3167.5069 3174.3080 3183.0694 3188.8239 3190.8237 3192.4681 3519.3602 3520.3483 3527.0318
redmass: 9.0431 7.9555 7.4751 8.2819 9.1319 9.9717 9.2585 9.4301 7.3489 7.1592 7.9065 7.5941 6.9329 6.7569 6.5397 5.7649 4.1981 4.3835 5.3767 6.3527 5.9922 5.0508 5.7933 4.8656 7.4256 8.7773 8.0945 7.4513 6.6757 7.4644 9.3204 2.7906 5.8874 3.5371 1.1558 4.7369 4.5845 3.9931 3.7494 7.4915 8.4600 7.7258 6.7698 4.8825 3.7069 7.1292 5.3063 6.3506 4.0368 4.3952 1.3763 1.4411 5.1144 4.7609 3.1294 4.0544 5.8063 5.2190 6.6323 6.8103 4.0201 2.1250 5.5901 5.9980 2.4569 1.5061 3.8966 2.2632 1.8090 7.1094 7.5851 7.1890 1.4078 1.5173 1.5754 2.4959 1.3956 3.2561 1.3292 2.7996 2.8945 3.8777 4.8132 2.8735 2.7602 2.0843 2.0168 2.0192 1.8662 2.1018 1.6856 1.2877 1.5152 1.1787 2.7637 2.2847 1.3971 1.8299 2.0261 1.8504 2.0794 2.0038 2.8626 3.7635 1.2933 3.4491 4.1374 1.5226 1.3270 1.9397 8.6902 2.8686 2.7998 4.4180 2.0248 1.8227 1.4615 1.3368 8.9680 11.6943 6.8341 7.3637 7.4698 7.8513 8.2379 7.7524 9.5825 9.1314 1.0549 1.0569 1.0970 1.0993 1.1096 1.0878 1.0893 1.0916 1.0931 1.0971 1.0979 1.0926 1.0929 1.0643 1.0644 1.0654
irintensity: 0.4469 2.2460 1.6119 1.3192 2.4172 0.1568 0.9003 2.5624 0.4633 0.4569 1.2461 0.6301 1.8414 0.1948 1.3793 6.8697 3.9018 1.4646 6.5680 5.4201 3.0726 0.7431 7.5039 8.1127 1.4878 2.1519 1.4708 10.2814 1.2380 3.1347 6.6061 1.1212 13.8849 0.7211 150.0717 9.2916 7.8282 1.1374 23.3787 6.1131 10.0041 2.1607 2.0626 16.9635 12.5753 11.6680 42.1049 21.6873 17.2427 4.5922 131.3312 127.5806 70.2982 27.6629 11.5670 3.0757 4.0565 8.7309 17.7549 27.0441 2.3225 23.3774 38.5557 3.6967 68.0382 86.8401 5.1847 13.5065 12.2970 20.5021 52.7948 31.7194 52.1914 29.6417 3.2046 7.8647 3.1662 80.0336 0.6035 49.4455 23.7727 169.2030 373.4074 117.6685 24.3004 32.5047 50.6378 198.3057 63.2528 16.5955 15.0284 74.7261 70.2974 4.5833 1.3328 81.0660 50.1838 27.4941 96.3604 33.7235 65.9061 63.1174 266.1273 168.0739 10.5531 53.8794 82.0943 17.3332 61.6091 9.6825 27.8458 7.6113 24.7077 92.8096 76.2360 179.8400 54.3380 22.1325 261.4764 174.5479 49.2523 154.9180 41.1282 227.1698 167.7832 67.7998 196.6263 170.9710 25.1363 62.8451 6.1655 39.9948 22.9079 8.9184 1.3089 6.5495 5.7022 0.9074 2.1107 3.7674 3.8596 56.6358 64.3319 24.0491
temp: 298.150 k
press: 1.00000 atm
elementType: 8 8 8 8 8 8 8 8 8 8 8 6 6 6 6 6 6 6 6 6 6 6 6 6 6 6 6 6 6 6 6 6 6 6 1 1 1 1 1 1 1 1 1 1 1 1 1 1 1 1
symmnumber: 1
zpe: 921710.6 jmol-1
zpe.correction: 0.351061 hartree
zpe.thermalcorrener: 0.380819 hartree
zpe.thermalcorrenthalpy: 0.381763 hartree
zpe.thermalcorrgfe: 0.285768 hartree
zpe.sumelectzpe: -1711.066927 hartree
zpe.sumelectthermal: -1711.037169 hartree
zpe.sumelectthermalent: -1711.036225 hartree
zpe.sumelectthermalfe: -1711.132220 hartree
dipole: -6.5089 2.6965 0.4881
dipole: 7.0622
quadrupole: -198.9583 -187.0660 -194.8282
quadrupole: 11.5945 -30.0259 0.3147
quadrupole: -5.3408 6.5515 -1.2107 11.5945 -30.0259 0.3147
hfenergy: -1711.417988 hartree
pointgroup: C01 [X(C23H16O11)]
dipole: -1.4964438 2.3359948 -0.154194 debye
polarizability: 345.2736822|13.0733097|325.6267272|-24.9014092|-44.9289454|256.9592652 unknown
InChI: InChI=1S/C23H16O11/c24-11(9-31-12-4-5-16-13(6-12)14(25)7-19(33-16)22(27)28)10-32-17-2-1-3-18-21(17)15(26)8-20(34-18)23(29)30/h1-8,11,24,27,29H,9-10H2
charge 0 multiplicity 1
50 atoms
O  -3.413827 -0.579973 -0.129876
O  -0.984149 -2.960691 -0.151109
O  -3.441921 -4.271343 -0.035465
O  -2.643146 4.215004 0.168553
O  4.41113 -1.460173 -0.553062
O  -1.746528 0.681509 -1.889243
O  3.277818 -4.174342 2.442939
O  -1.904124 6.582964 -0.679999
O  6.869487 -0.635616 -0.903522
O  -0.915828 5.731213 -2.608809
O  7.694119 -1.909059 0.861366
C  -3.331918 -2.925229 -0.601588
C  -3.659653 -1.89221 0.499375
C  -1.959789 -2.661925 -1.23024
C  -3.502777 0.58636 0.603638
C  -2.928665 1.755164 -0.010817
C  0.351245 -2.565762 -0.300945
C  -3.116653 2.989172 0.682723
C  2.630159 -2.773465 0.565087
C  1.262012 -3.123476 0.616336
C  3.060057 -1.854336 -0.431514
C  -4.137088 0.664312 1.86338
C  -2.119882 1.730033 -1.262528
C  0.796296 -1.634358 -1.286642
C  -3.770447 3.090823 1.926932
C  2.155501 -1.284979 -1.349841
C  -4.263383 1.913614 2.514697
C  3.609299 -3.351339 1.527993
C  -1.713415 3.060758 -1.748529
C  -1.973903 4.209779 -1.047742
C  4.990567 -2.890481 1.333781
C  5.327511 -1.998356 0.341021
C  -1.539773 5.55289 -1.537988
C  6.733691 -1.533703 0.149992
H  -4.096033 -2.87001 -1.395599
H  -2.987362 -2.017824 1.369955
H  -4.714873 -1.995515 0.813945
H  -1.9017 -1.607637 -1.551671
H  -1.772014 -3.353186 -2.073049
H  0.93147 -3.834573 1.379256
H  -4.546294 -0.235078 2.330626
H  0.092258 -1.16133 -1.976261
H  -3.870757 4.07024 2.399936
H  2.521598 -0.571651 -2.093166
H  -4.764078 1.963731 3.486783
H  -2.58732 -4.465384 0.433095
H  -1.164855 3.125497 -2.691106
H  5.776341 -3.263499 1.995136
H  -1.589387 7.448846 -1.057989
H  7.825686 -0.367405 -0.976444
