program: Gaussian 09
title: 000286869
version: EM64L-G09RevD.01
frameworkgroup: C1[X(C20H18N2O6)]
method: RPBEPBE
basis: SDD
operation: Freq
keyword: #p
keyword: freq=noraman
keyword: PBEPBE/SDD
title: #p freq=noraman PBEPBE/SDD
converged: YES YES NO NO
title: Mulliken charges:
elementType: O O O O O O N N C C C C C C C C C C C C C C C C C C C C H H H H H H H H H H H H H H H H H H
charge: -0.277932 -0.278010 -0.260234 -0.240790 -0.280114 -0.207206 -0.017283 0.031309 0.255082 0.503043 -0.071307 -0.535517 0.380890 0.012069 -0.587975 0.229995 0.197954 -0.349849 0.021205 -0.474219 -0.404183 0.223899 0.227890 -0.458294 -0.538183 -0.513947 -0.537140 -0.518137 0.313065 0.261199 0.238809 0.266956 0.240937 0.283733 0.243374 0.240269 0.234964 0.231708 0.213308 0.261957 0.241813 0.251035 0.235752 0.216651 0.254101 0.237356
chargesum: 0.00000
title: Mulliken charges with hydrogens summed into heavy atoms:
elementType: O O O O O O N N C C C C C C C C C C C C C C C C C C C C
charge: -0.277932 -0.278010 -0.260234 -0.240790 -0.280114 -0.207206 -0.017283 0.031309 0.255082 0.503043 -0.071307 -0.222452 0.380890 0.012069 -0.326776 0.229995 0.197954 -0.111041 0.021205 -0.207263 -0.163246 0.223899 0.227890 -0.174561 0.180423 0.193026 0.191459 0.189971
polarizability: 4.76725122e+02 1.58976650e+01 2.34436011e+02 9.44550225e+00 -2.17802290e+00 2.04984637e+02
1716.lowfreq: -3.1446 0.0002 0.0004 0.0008 2.1824 3.7842 15.2396 23.5741 31.7573
frequency: 15.1859 23.5112 31.7388 36.1341 51.1535 52.6113 82.7077 94.0073 99.5296 108.8431 115.7693 135.2615 138.4595 154.5374 166.7134 172.3552 179.9559 199.4230 203.2437 214.3787 235.9944 246.3270 254.1052 280.0085 285.6439 306.8391 321.5237 336.6103 348.8476 359.7735 363.3426 383.7397 393.6971 422.0405 460.7901 472.3793 474.9353 485.8739 518.1892 554.7046 584.9612 590.0719 599.3119 641.0290 651.9575 681.5442 692.6168 700.0090 727.2397 734.7997 735.8720 745.8766 784.2568 805.5821 828.0892 837.9044 870.0772 884.9562 900.7477 904.8684 905.4991 914.0073 943.0621 965.8159 972.2360 976.9615 1028.0478 1071.4134 1098.8158 1109.7498 1110.7925 1111.1667 1113.4146 1125.7531 1146.1664 1152.2086 1156.1813 1161.2747 1168.4130 1185.4977 1205.7421 1233.1016 1249.5789 1252.8245 1267.1189 1282.2467 1303.1020 1330.2945 1355.6779 1373.2853 1382.0812 1387.0734 1414.2859 1428.9064 1431.2796 1443.1508 1445.0611 1451.0690 1456.4404 1458.3997 1467.6111 1469.6353 1471.8485 1474.0870 1477.4294 1477.9847 1484.5201 1500.3001 1526.9233 1535.4308 1540.2029 1563.4480 1607.4598 1624.0651 2977.3592 2980.7072 2981.5322 2983.8397 3072.0557 3078.8895 3090.0402 3096.2118 3132.5064 3132.6658 3132.7770 3135.7253 3139.0633 3156.1282 3158.1069 3164.1644 3177.5643 3182.8186
redmass: 6.4942 4.3756 4.5550 2.5727 3.0308 2.0247 4.1807 3.0923 3.2832 3.4342 4.8656 3.4582 3.5023 3.0163 3.5301 3.0230 3.2085 2.4853 3.2768 5.8246 3.6753 1.4496 1.7751 3.2849 5.0651 5.5987 4.2354 5.1771 5.3212 5.5476 5.8623 7.5518 7.9828 5.2412 4.0305 4.4849 4.9507 5.0939 5.0739 6.7535 6.3150 5.5181 6.1995 6.3902 6.8963 7.8767 6.8209 8.3987 5.7906 4.4956 4.1016 4.0966 4.2494 3.2834 3.7747 1.5202 1.9446 4.9759 1.6053 1.5791 1.6734 6.3737 7.4262 1.4316 5.9312 6.3732 4.7589 2.2488 4.7257 1.2372 1.2392 1.2573 1.2605 2.6210 1.5087 1.4934 1.3849 1.5254 2.0078 4.6320 1.9875 2.1428 1.9990 1.5554 3.0247 2.2053 10.8926 6.3025 7.2302 4.0819 3.6456 5.5221 2.1836 1.5140 1.2622 1.3190 1.3034 1.6723 1.0778 1.4092 1.0491 1.1067 1.1180 1.1281 1.0583 1.0796 2.7402 3.3272 8.2452 9.3911 7.7552 6.3937 7.0839 7.0718 1.0316 1.0329 1.0328 1.0347 1.1045 1.1050 1.0986 1.0969 1.1014 1.1040 1.0876 1.1053 1.1014 1.0960 1.0944 1.0907 1.0924 1.0911
irintensity: 1.6251 1.9249 1.8631 3.1378 2.5755 7.3515 0.6439 3.9780 2.7515 1.1521 0.7033 4.1497 5.0559 6.1047 4.3287 9.6859 6.0748 11.2134 1.7696 2.6657 6.5615 2.3868 3.0214 2.3969 1.7806 9.0571 3.6396 43.4945 0.2587 2.1310 0.2133 3.3667 0.4694 7.1989 9.9514 6.6974 5.2124 14.5905 0.8772 25.3370 15.5733 0.2920 28.3730 0.0172 45.0782 4.6621 1.3470 8.3344 99.2347 2.5600 6.6610 3.8720 3.4790 7.8897 10.6728 4.1052 25.7795 63.4407 50.3995 14.1751 14.5879 36.4017 12.1198 1.8386 88.9433 81.8434 26.0390 5.2885 174.9554 9.3449 13.6347 0.2245 0.5734 53.4401 13.5438 41.5239 15.2648 15.7003 11.0040 137.6668 65.0139 91.3895 105.8349 151.5445 703.3615 335.6902 74.0200 13.4896 13.3866 55.8113 29.6690 2.7779 10.5109 11.8000 1.3588 30.8878 4.2782 79.4506 16.9291 7.1991 15.4391 74.9881 70.0555 99.2629 36.8171 20.8586 14.6933 249.2680 157.4949 135.5535 10.4960 6.3700 60.4160 14.5452 38.0282 65.6174 77.0733 103.3562 29.4295 26.8049 35.8267 42.2447 30.0925 15.8186 1.0241 15.5906 20.4865 17.4365 27.0494 3.5318 3.4378 23.9059
temp: 298.150 k
press: 1.00000 atm
elementType: 8 8 8 8 8 8 7 7 6 6 6 6 6 6 6 6 6 6 6 6 6 6 6 6 6 6 6 6 1 1 1 1 1 1 1 1 1 1 1 1 1 1 1 1 1 1
symmnumber: 1
zpe: 898652.4 jmol-1
zpe.correction: 0.342279 hartree
zpe.thermalcorrener: 0.369215 hartree
zpe.thermalcorrenthalpy: 0.370159 hartree
zpe.thermalcorrgfe: 0.283054 hartree
zpe.sumelectzpe: -1331.630398 hartree
zpe.sumelectthermal: -1331.603462 hartree
zpe.sumelectthermalent: -1331.602517 hartree
zpe.sumelectthermalfe: -1331.689623 hartree
dipole: 1.5606 -2.5931 5.7897
dipole: 6.5330
quadrupole: -124.3444 -150.0817 -158.2612
quadrupole: -3.1477 5.5915 1.1790
quadrupole: 19.8847 -5.8526 -14.0321 -3.1477 5.5915 1.1790
hfenergy: -1331.9726767 hartree
pointgroup: C01 [X(C20H18N2O6)]
dipole: 0.7325349 -1.4253307 -2.0095305 debye
polarizability: 459.5787155|-49.8741405|221.4922058|41.9280188|-21.4105794|235.0748484 unknown
InChI: InChI=1S/C20H18N2O6/c1-25-15-7-11-5-6-21-19(12(11)8-16(15)26-2)20(23)13-9-17(27-3)18(28-4)10-14(13)22-24/h5-10H,1-4H3
charge 0 multiplicity 1
46 atoms
O  -4.491163 2.079101 -1.456943
O  -6.354175 0.672429 0.1861
O  4.834133 -1.778331 0.164549
O  0.242235 0.966217 -0.90623
O  5.694686 -0.248485 2.38794
O  0.285772 2.192659 2.043049
N  -0.363969 -0.995726 2.017945
N  1.443874 1.993646 2.585921
C  -2.169338 0.07656 0.726107
C  -3.15126 -0.594932 1.554864
C  -0.77553 -0.170379 1.019357
C  -2.62123 0.959085 -0.302282
C  1.748417 0.244484 0.82505
C  0.356564 0.44922 0.25212
C  -4.540039 -0.379844 1.299939
C  -3.986233 1.176844 -0.513731
C  -4.973885 0.475718 0.286896
C  -2.685899 -1.457515 2.595444
C  2.236731 1.008335 1.931802
C  2.625498 -0.659197 0.208446
C  -1.310282 -1.626456 2.788168
C  3.947487 -0.848049 0.693737
C  4.432999 -0.075181 1.807448
C  3.563064 0.8402 2.412185
C  -3.514925 2.871597 -2.219809
C  -6.9930 0.704064 -1.147737
C  4.370613 -2.645798 -0.9315
C  6.886967 -0.174247 1.514089
H  -1.863768 1.459609 -0.907675
H  -5.299995 -0.883235 1.905927
H  -3.402968 -1.979939 3.237743
H  2.263639 -1.242583 -0.642649
H  -0.922706 -2.279331 3.577058
H  3.909947 1.438876 3.259111
H  -2.883101 3.474413 -1.541756
H  -4.120488 3.530425 -2.858912
H  -2.874218 2.220744 -2.843404
H  -8.071721 0.74306 -0.933587
H  -6.754394 -0.218227 -1.710897
H  -6.672139 1.587333 -1.719953
H  3.498883 -3.245861 -0.613076
H  5.222615 -3.305758 -1.147125
H  4.116799 -2.050715 -1.827952
H  6.91109 0.793767 0.978068
H  6.904219 -1.008273 0.794515
H  7.740793 -0.240321 2.204639
