program: Gaussian 09
title: 000286873
version: EM64L-G09RevD.01
frameworkgroup: C1[X(C20H18N2O7)]
method: RPBEPBE
basis: SDD
operation: Freq
keyword: #p
keyword: freq=noraman
keyword: PBEPBE/SDD
title: #p freq=noraman PBEPBE/SDD
converged: YES YES NO NO
title: Mulliken charges:
elementType: O O O O O O O N N C C C C C C C C C C C C C C C C C C C C H H H H H H H H H H H H H H H H H H
charge: -0.276817 -0.276931 -0.257251 -0.283012 -0.228921 -0.224583 -0.206683 -0.017393 0.014798 0.264555 0.503955 -0.084535 0.338374 0.047593 -0.534993 -0.587601 0.232155 0.198205 0.292597 -0.345250 -0.477363 0.190127 -0.538771 0.251364 -0.402806 -0.538101 -0.510914 -0.494689 -0.535197 0.314640 0.261878 0.239774 0.283936 0.294760 0.241798 0.236498 0.240991 0.243252 0.232068 0.260488 0.214665 0.246987 0.232733 0.229052 0.231557 0.236644 0.246367
chargesum: 0.00000
title: Mulliken charges with hydrogens summed into heavy atoms:
elementType: O O O O O O O N N C C C C C C C C C C C C C C C C C C C C
charge: -0.276817 -0.276931 -0.257251 -0.283012 -0.228921 -0.224583 -0.206683 -0.017393 0.014798 0.264555 0.503955 -0.084535 0.338374 0.047593 -0.220353 -0.325723 0.232155 0.198205 0.292597 -0.105477 -0.193427 0.190127 -0.244011 0.251364 -0.161008 0.182640 0.196306 0.214083 0.179371
polarizability: 4.64164950e+02 7.81747333e+00 2.55718493e+02 2.86997910e+01 4.39842442e+00 1.95582232e+02
1716.lowfreq: -7.4277 -3.9083 -0.0007 -0.0003 0.0007 3.2687 14.2531 15.5810 19.6527
frequency: 13.7129 15.4277 19.5997 29.4524 31.9977 47.5013 70.3324 91.3542 98.1227 104.5893 110.2036 118.0236 135.0438 152.2764 157.1734 167.6726 171.4375 171.9078 198.6130 209.3940 224.4233 239.3969 245.3651 264.6283 280.5555 292.9041 300.5887 322.7537 341.3591 356.3239 362.6107 376.1221 390.5113 406.6839 453.2064 458.1713 470.2807 471.1292 496.0745 527.6345 564.8274 577.3427 588.4821 598.0644 628.3568 649.6315 661.5469 687.0882 708.0390 718.1506 719.4313 729.9401 740.4584 749.6280 763.6581 804.9819 823.3845 839.0699 879.7173 886.1788 898.5378 901.0397 907.2209 912.6901 937.9522 968.0982 976.3689 981.9803 1017.0568 1071.4164 1081.1438 1107.3644 1108.5702 1112.3892 1113.8861 1127.2056 1138.1261 1152.3126 1155.6246 1161.7700 1171.8365 1182.9826 1206.8187 1215.0824 1238.0118 1249.2249 1251.0702 1275.1691 1283.0461 1327.5565 1341.7191 1354.8233 1377.8330 1382.5640 1402.9222 1414.2570 1429.0042 1438.2930 1442.3420 1446.0651 1451.4324 1457.7747 1458.3658 1461.7028 1466.4911 1468.3863 1472.8343 1474.7431 1475.0697 1498.1590 1499.9659 1538.0918 1550.9700 1563.5122 1566.9975 1613.4781 1623.6150 2970.4423 2977.4407 2986.0943 3004.0154 3063.0239 3072.6506 3098.2077 3115.2493 3132.1386 3133.5553 3133.8769 3135.3864 3136.3622 3157.3872 3159.3522 3172.7711 3186.4920 3187.9673
redmass: 3.8990 5.6005 2.1725 4.5456 3.8956 4.4006 5.4309 2.8926 5.3728 4.8760 4.6429 8.1754 3.7890 3.2142 4.9358 1.7898 3.1693 2.2057 3.1754 3.3616 2.9985 4.2869 1.4553 1.4388 3.0327 5.2498 6.2538 4.0986 6.8501 5.1685 5.1541 6.2010 6.9682 7.7885 4.9131 3.8326 4.4217 4.9888 5.6752 6.9700 6.0823 6.8795 5.7286 6.5647 7.3472 6.6134 7.8640 7.6973 8.6508 7.1559 4.5020 5.9730 3.9385 4.7227 5.0570 3.1401 4.8649 1.4239 3.1755 2.0446 1.6928 1.6163 1.6890 5.6915 8.1698 1.4384 6.8583 6.2073 6.7474 2.3404 3.1625 1.2433 1.2409 1.2603 1.2568 2.4219 1.6927 1.5090 1.4802 1.5722 2.4351 2.6289 2.1302 4.6804 2.1391 1.6282 1.5127 4.1403 2.3702 6.4841 9.6449 7.3806 4.6880 3.8476 6.5992 2.2271 1.4805 1.2550 1.3329 1.3051 1.5640 1.0558 1.5062 1.0553 1.0495 1.0488 1.1338 1.0914 1.0628 3.1541 3.3898 7.8195 8.8254 7.9588 8.3554 7.5862 7.1290 1.0323 1.0317 1.0342 1.0293 1.1045 1.1047 1.0974 1.1038 1.1006 1.1014 1.0873 1.1059 1.1055 1.0971 1.0934 1.0918 1.0902 1.0910
irintensity: 0.6811 2.7627 5.5141 1.3755 5.6208 3.0305 6.4082 2.8131 2.5225 0.7710 3.3437 2.6065 1.1313 7.8114 7.9843 3.2247 5.7783 3.6711 6.4565 0.9970 6.8581 2.5781 0.5225 0.1483 1.8733 5.4161 5.9902 5.0966 17.4096 3.8963 4.7139 2.5232 4.8341 5.4994 4.9274 2.6655 5.7341 9.0023 12.2201 24.0800 14.2432 4.1702 2.0676 13.7110 4.4482 40.4975 6.3817 1.2257 23.5716 3.6730 51.7787 9.1645 19.4177 3.8372 3.5601 4.7829 6.6788 2.5548 31.4026 34.9733 52.6498 47.5217 16.7120 19.5838 53.0185 1.1932 59.3964 131.8480 58.4271 5.1890 107.9215 1.7054 11.5547 0.2195 0.1615 43.7698 31.4946 13.1375 46.9645 15.1397 141.7472 40.0151 63.1192 341.9458 26.9922 52.5116 89.2288 569.2054 499.2939 48.0206 247.4675 23.7904 22.7733 44.0330 18.6515 14.5036 10.7471 1.4935 32.2871 7.3696 71.7772 15.7702 8.1338 33.3830 16.3835 14.2044 153.0023 75.1873 10.9953 256.4753 116.7755 13.0401 144.7823 95.7897 53.1793 45.3096 17.1347 52.6857 38.5524 98.5185 80.5189 33.6823 29.0607 41.7430 30.5138 22.1988 26.6078 0.7338 20.6915 16.0708 22.3003 18.5557 0.6388 4.5793 24.2621
temp: 298.150 k
press: 1.00000 atm
elementType: 8 8 8 8 8 8 8 7 7 6 6 6 6 6 6 6 6 6 6 6 6 6 6 6 6 6 6 6 6 1 1 1 1 1 1 1 1 1 1 1 1 1 1 1 1 1 1
symmnumber: 1
zpe: 911781.2 jmol-1
zpe.correction: 0.347279 hartree
zpe.thermalcorrener: 0.375080 hartree
zpe.thermalcorrenthalpy: 0.376024 hartree
zpe.thermalcorrgfe: 0.285448 hartree
zpe.sumelectzpe: -1406.764546 hartree
zpe.sumelectthermal: -1406.736746 hartree
zpe.sumelectthermalent: -1406.735801 hartree
zpe.sumelectthermalfe: -1406.826378 hartree
dipole: -2.8333 2.4331 -2.3578
dipole: 4.4166
quadrupole: -102.8704 -161.5337 -170.0285
quadrupole: 10.8510 -2.1137 11.8178
quadrupole: 41.9404 -16.7228 -25.2176 10.8510 -2.1137 11.8178
hfenergy: -1407.1118253 hartree
pointgroup: C01 [X(C20H18N2O7)]
dipole: 1.122072 0.8263005 -1.0380504 debye
polarizability: 462.9077728|33.4583177|198.4565587|8.2856362|12.0292487|254.1013435 unknown
InChI: InChI=1S/C20H18N2O7/c1-26-15-7-11-5-6-21-19(12(11)8-16(15)27-2)20(23)13-9-17(28-3)18(29-4)10-14(13)22(24)25/h5-10H,1-4H3
charge 0 multiplicity 1
47 atoms
O  -5.015318 -1.281619 -1.434431
O  -6.400455 0.360154 0.450181
O  4.529575 1.352108 -2.08817
O  5.912581 0.286395 0.255047
O  -0.182957 -0.806222 -1.648817
O  2.182056 -1.944323 2.864089
O  0.378922 -1.890949 1.46512
N  -0.033014 1.269691 1.260266
N  1.600154 -1.568824 1.769456
C  -2.138062 0.418071 0.297379
C  -2.885561 1.212231 1.254832
C  -0.694649 0.497042 0.357682
C  1.704806 -0.178336 -0.302704
C  0.212209 -0.248465 -0.580861
C  -2.859931 -0.404717 -0.621039
C  -4.313086 1.173179 1.232175
C  -4.257664 -0.448533 -0.60539
C  -5.009581 0.375551 0.324326
C  2.354891 -0.761181 0.810894
C  -2.15924 2.018208 2.183373
C  2.512198 0.489628 -1.239804
C  3.91144 0.631384 -1.07611
C  3.744616 -0.631237 1.017601
C  4.534579 0.078427 0.095988
C  -0.75981 2.017052 2.15194
C  -4.282861 -2.183071 -2.337185
C  -7.251689 0.369478 -0.75991
C  5.988087 1.304305 -2.326319
C  6.538106 -0.248653 1.470786
H  -2.282604 -1.000424 -1.329041
H  -4.894876 1.773133 1.939003
H  -2.695714 2.630109 2.916504
H  2.065236 0.93257 -2.134001
H  4.16853 -1.09793 1.909505
H  -0.175394 2.621644 2.853028
H  -3.677234 -1.611227 -3.064563
H  -5.062013 -2.755655 -2.860714
H  -3.628592 -2.865733 -1.764248
H  -8.271549 0.51807 -0.374074
H  -7.1712 -0.580807 -1.308229
H  -6.973055 1.21112 -1.421774
H  6.53581 1.827926 -1.528418
H  6.1138 1.817605 -3.291612
H  6.340711 0.261344 -2.395831
H  6.45807 -1.351688 1.508811
H  6.082595 0.191634 2.377852
H  7.594939 0.046532 1.401004
