program: Gaussian 09
title: 000286871
version: EM64L-G09RevD.01
frameworkgroup: C1[X(C20H20N2O7)]
method: RPBEPBE
basis: SDD
operation: Freq
keyword: #p
keyword: freq=noraman
keyword: PBEPBE/SDD
title: #p freq=noraman PBEPBE/SDD
converged: YES YES NO NO
title: Mulliken charges:
elementType: O O O O O O O N N C C C C C C C C C C C C C C C C C C C C H H H H H H H H H H H H H H H H H H H H
charge: -0.438275 -0.280363 -0.253353 -0.277494 -0.279401 -0.217564 -0.257419 -0.142344 0.010104 -0.378718 0.043266 0.280129 0.579287 0.497458 0.134123 -0.585297 -0.483009 -0.584013 -0.371620 0.207741 0.192296 0.195573 -0.546397 0.250208 -0.391416 -0.534977 -0.493116 -0.505822 -0.535108 0.302765 0.299938 0.298779 0.262321 0.240733 0.294794 0.245769 0.371833 0.251444 0.237707 0.231282 0.230919 0.233136 0.244772 0.230645 0.257621 0.217257 0.229701 0.246727 0.237382
chargesum: 0.00000
title: Mulliken charges with hydrogens summed into heavy atoms:
elementType: O O O O O O O N N C C C C C C C C C C C C C C C C C C C C
charge: -0.066442 -0.280363 -0.253353 -0.277494 -0.279401 -0.217564 -0.257419 -0.142344 0.010104 -0.075953 0.043266 0.280129 0.579287 0.497458 0.134123 -0.285359 -0.184230 -0.321692 -0.130888 0.207741 0.192296 0.195573 -0.251603 0.250208 -0.145648 0.185455 0.215711 0.199701 0.178702
polarizability: 3.33125253e+02 -1.70598988e+01 3.33466379e+02 5.03790826e+00 -8.50021735e+00 2.06487005e+02
1716.lowfreq: -6.7405 -0.0013 -0.0009 -0.0009 2.0270 5.2326 13.2595 17.0413 21.4727
frequency: 12.7611 16.7885 21.4382 29.1220 36.7045 52.6507 65.0592 91.1884 103.1504 110.8071 121.8227 131.2855 138.6506 150.7888 160.5039 170.0751 175.7408 178.6564 204.7898 206.2480 218.2144 244.8570 252.4480 263.5226 281.5643 286.3268 300.9774 308.5544 328.2721 340.7196 362.2280 377.5116 387.6262 433.1630 453.0147 459.7199 461.3227 472.7639 482.8456 521.7180 557.7927 562.2028 594.1419 607.5611 627.7116 643.5540 664.5772 678.7553 683.9584 707.9223 718.4095 724.4244 731.2395 735.4894 743.0303 784.4194 806.8021 823.2729 837.2883 875.0776 877.5777 898.8652 909.4619 913.1831 913.7725 923.0968 962.8220 970.1026 979.6288 986.0416 1025.2494 1047.7016 1084.5442 1107.4982 1107.9221 1109.1040 1112.5568 1126.6513 1136.8569 1148.0712 1153.3961 1162.6909 1163.4785 1171.4849 1202.7320 1207.2401 1226.3953 1241.2280 1263.1108 1267.5762 1268.5410 1285.7430 1294.5978 1324.3507 1329.5943 1378.8179 1379.8371 1393.2080 1409.4224 1410.8343 1425.9746 1432.7767 1436.5556 1446.5870 1447.1338 1452.5132 1458.0598 1460.1088 1461.0449 1464.7290 1467.6197 1469.8011 1471.9336 1474.5661 1498.6831 1509.1420 1545.6158 1550.7412 1577.2200 1613.1715 1627.5180 2970.1926 2982.7401 2989.8682 3005.7853 3062.6357 3071.6670 3079.4797 3100.9678 3117.2523 3132.1754 3133.8383 3134.7041 3135.0771 3139.1250 3141.2749 3155.2741 3157.8445 3162.0921 3167.4827 3186.0145
redmass: 2.5734 2.6276 4.1577 3.7599 5.4627 4.3466 4.4947 2.9651 4.9829 5.6962 4.4127 4.5281 4.9821 4.1443 3.8041 2.6210 1.9376 2.7726 2.2413 3.0276 3.1290 1.5357 3.4001 1.4982 4.8310 4.5514 5.5711 5.4179 5.0146 4.9348 5.0490 6.2415 5.2640 7.1220 4.1284 4.5298 6.0760 5.1227 4.3569 6.4481 5.3331 4.7779 5.6030 4.2475 5.8933 7.0645 5.0759 1.9142 3.2192 6.6594 6.0253 5.9128 6.1472 3.4310 3.9868 3.9345 4.7731 1.8201 2.2969 2.3674 2.4836 1.7156 2.3909 2.3607 1.6242 6.8646 1.4079 8.2815 5.7927 6.6356 4.6195 5.6775 2.1990 1.2424 1.2712 1.2474 1.2577 2.3355 1.7781 1.7853 1.5255 1.6172 1.5732 3.0624 1.8185 5.9076 1.9133 1.5026 1.7827 3.1142 2.1492 1.5562 1.5218 4.2558 5.5621 5.2236 2.8907 4.0481 2.3425 3.0114 1.3276 1.3948 1.2507 1.4502 1.3763 1.1999 1.0548 1.0738 1.9719 1.0559 1.0514 1.0984 1.0825 1.0929 3.1612 3.8804 7.7432 8.1696 6.2820 6.9411 6.5927 1.0323 1.0316 1.0326 1.0287 1.1045 1.0843 1.1040 1.0995 1.1046 1.1005 1.1055 1.1007 1.1058 1.0937 1.0870 1.0691 1.0919 1.0895 1.0957 1.0900
irintensity: 1.0889 5.2844 0.3583 2.5375 0.7830 5.1159 5.1810 5.4822 2.1599 3.8522 0.7048 3.7022 3.0145 1.6434 8.3855 5.3035 1.9058 6.9578 0.9561 2.6931 0.7208 1.4033 4.3577 0.4614 3.2102 3.8141 4.5302 1.8000 9.9797 8.5654 0.9071 5.5888 7.6868 1.4859 1.7840 7.5087 2.2631 1.0597 3.1619 17.2404 2.6190 3.0687 2.1913 13.6176 6.1921 14.2650 0.3822 87.3101 27.1960 8.3360 36.4858 6.2705 17.2414 11.5237 8.0040 5.5533 14.6371 9.8135 0.4931 5.2273 16.6128 37.5962 17.4892 69.3653 61.4829 37.0102 1.6745 63.9124 39.1065 78.8917 51.9740 25.4666 5.0177 0.3363 1.7000 3.3701 0.0314 85.8049 25.9023 30.7240 34.7095 21.2565 17.4754 182.9155 35.4907 438.9289 8.6894 74.4606 126.0347 299.8274 167.0471 5.5942 41.0514 356.3913 53.0645 4.1976 120.2305 31.0087 30.8807 23.7899 50.3817 6.0053 8.9040 35.3730 2.7937 30.4336 18.8834 40.4540 24.8319 17.6465 20.5710 76.1112 23.1852 79.5382 218.0419 188.1699 87.6641 86.2189 5.9800 61.5451 29.8427 48.7671 35.6128 88.8348 69.4160 33.6318 2.6655 27.6823 38.1265 29.6378 21.7927 17.2136 45.8072 17.6542 19.7803 4.8412 247.5747 9.5254 38.6444 11.7306 4.2773
temp: 298.150 k
press: 1.00000 atm
elementType: 8 8 8 8 8 8 8 7 7 6 6 6 6 6 6 6 6 6 6 6 6 6 6 6 6 6 6 6 6 1 1 1 1 1 1 1 1 1 1 1 1 1 1 1 1 1 1 1 1
symmnumber: 1
zpe: 973253.1 jmol-1
zpe.correction: 0.370693 hartree
zpe.thermalcorrener: 0.398620 hartree
zpe.thermalcorrenthalpy: 0.399565 hartree
zpe.thermalcorrgfe: 0.309328 hartree
zpe.sumelectzpe: -1407.942388 hartree
zpe.sumelectthermal: -1407.914460 hartree
zpe.sumelectthermalent: -1407.913515 hartree
zpe.sumelectthermalfe: -1408.003753 hartree
dipole: -1.0353 -1.0103 -6.0296
dipole: 6.2007
quadrupole: -130.5432 -157.9800 -182.2343
quadrupole: 1.6884 20.3029 3.1346
quadrupole: 26.3760 -1.0608 -25.3152 1.6884 20.3029 3.1346
hfenergy: -1408.3130801 hartree
pointgroup: C01 [X(C20H20N2O7)]
dipole: 0.1113579 2.0260161 -1.3543653 debye
polarizability: 321.348772|7.4151064|254.1444923|-23.8812549|62.9459515|297.5853725 unknown
InChI: InChI=1S/C20H20N2O7/c1-26-15-7-11-5-6-21-19(12(11)8-16(15)27-2)20(23)13-9-17(28-3)18(29-4)10-14(13)22(24)25/h5-10,20,23H,1-4H3
charge 0 multiplicity 1
49 atoms
O  0.977124 -3.102165 0.25131
O  -2.731924 2.337633 2.071452
O  2.744018 -0.252417 -3.482261
O  -5.082025 2.141998 0.45848
O  4.48979 1.561127 -1.98142
O  3.00275 0.973555 2.756154
O  0.912883 0.079929 2.682726
N  -1.118434 -2.695079 -1.157296
N  2.034453 0.41123 2.103569
C  0.406537 -1.777521 0.472601
C  -0.953485 -1.702571 -0.255654
C  -1.952966 -0.699763 -0.014554
C  1.404094 -0.735266 -0.084988
C  -3.164592 -0.761121 -0.805855
C  2.197685 0.180365 0.664909
C  -1.807483 0.333893 0.962595
C  1.673891 -0.807235 -1.467229
C  -4.184854 0.210428 -0.58044
C  -3.299017 -1.815676 -1.766347
C  -2.817957 1.280592 1.160365
C  2.657461 -0.0313 -2.116229
C  -4.042133 1.213831 0.380817
C  3.230362 0.939027 0.052113
C  3.475649 0.849742 -1.323935
C  -2.275996 -2.752791 -1.904726
C  -1.49097 2.459339 2.854016
C  3.513607 0.619136 -4.395076
C  -5.528375 2.657183 1.771978
C  5.356389 2.413542 -1.158291
H  0.270148 -1.636869 1.555472
H  -0.893978 0.368165 1.563708
H  1.107104 -1.507277 -2.08823
H  -5.115132 0.184055 -1.156547
H  -4.203446 -1.890139 -2.378704
H  3.826784 1.586057 0.69848
H  -2.345582 -3.580869 -2.616113
H  0.408395 -3.482966 -0.498713
H  -1.311959 1.559728 3.469645
H  -1.646307 3.337511 3.497043
H  -0.622964 2.623009 2.189057
H  3.215957 1.674251 -4.277185
H  3.244246 0.251737 -5.396761
H  4.595349 0.517876 -4.218503
H  -6.479501 3.166718 1.554315
H  -4.79183 3.358041 2.192076
H  -5.698426 1.82479 2.479513
H  4.777161 3.223028 -0.674588
H  6.083545 2.844137 -1.861672
H  5.883058 1.818273 -0.388677
