program: Gaussian 09
title: 000027448
version: EM64L-G09RevD.01
frameworkgroup: C1[X(C11H6Br3NOS)]
method: RPBEPBE
basis: SDD
operation: Freq
keyword: #p
keyword: freq=noraman
keyword: PBEPBE/SDD
title: #p freq=noraman PBEPBE/SDD
converged: YES YES NO NO
title: Mulliken charges:
elementType: Br Br Br S O N C C C C C C C C C C C H H H H H H
charge: 0.078759 0.138836 0.014458 0.271338 -0.252138 -0.484254 0.512252 -0.308797 0.276216 -0.329252 -0.444932 -0.109832 0.072189 -0.163843 -0.149189 -0.239338 -0.548973 0.313695 0.315166 0.229801 0.303816 0.251929 0.252093
chargesum: 0.00000
title: Mulliken charges with hydrogens summed into heavy atoms:
elementType: Br Br Br S O N C C C C C C C C C C C
charge: 0.078759 0.138836 0.014458 0.271338 -0.252138 -0.170559 0.512252 -0.308797 0.276216 -0.014087 -0.215131 0.193984 0.072189 0.088086 0.102904 -0.239338 -0.548973
polarizability: 4.20724892e+02 8.70067468e-02 1.90026720e+02 -8.26163144e-02 2.92474701e-01 6.54062751e+01
1716.lowfreq: -3.6117 -3.4198 -0.0007 0.0002 0.0007 0.8970 11.5147 20.4751 37.7170
frequency: 11.4949 20.4590 37.7125 61.7502 83.2591 98.0371 119.0015 122.0896 143.3682 156.8901 218.1068 261.1904 262.9872 289.1943 322.7923 323.3792 364.9474 408.9421 417.2891 446.7832 461.5877 511.1445 583.6462 596.0249 614.0303 621.8140 659.3434 704.1243 710.7044 738.9655 807.9849 816.7241 841.9191 849.0621 894.3185 923.7886 944.4604 986.1125 989.4460 1030.3006 1063.8625 1118.9242 1139.0522 1188.9945 1204.0479 1263.0571 1295.5537 1306.3430 1364.8271 1398.2633 1441.7910 1474.0640 1507.3080 1537.2693 1581.6130 1599.2960 1601.8209 3120.6553 3166.1729 3172.9273 3197.9117 3202.2591 3507.2724
redmass: 5.7268 12.4098 18.5899 7.2448 13.3460 39.4678 15.1590 6.3507 25.9398 7.5329 10.0564 10.7187 15.4033 10.3574 6.5247 9.5359 7.0176 2.9809 10.9699 7.3656 6.9113 2.6527 4.4813 9.6606 1.3076 7.1855 7.5162 5.2537 4.4390 9.0831 7.4501 1.3981 6.8024 1.4163 1.4110 11.1214 1.3638 1.3267 4.9311 5.4607 2.4533 1.3563 1.6536 1.1283 3.7337 2.0170 1.6364 3.0222 5.3259 4.2798 10.7243 2.4891 2.4388 7.0659 9.9491 3.5111 5.1738 1.0903 1.0913 1.0951 1.0954 1.0956 1.0766
irintensity: 2.3685 0.1591 0.0831 2.0243 2.3386 0.0552 2.2484 3.4860 0.2098 0.0324 0.1920 3.7818 0.7057 14.2024 1.0189 1.8203 18.2705 0.0501 5.3615 9.2299 0.1928 58.3104 9.0179 5.4217 34.9952 0.2733 7.2936 17.3918 8.9653 83.2414 9.4600 38.3727 3.3542 61.9026 17.4603 44.0155 1.4619 3.3141 54.7814 16.5630 42.7884 21.8112 35.5248 0.0026 59.5477 101.4022 0.0188 122.5535 202.0267 24.2353 237.1864 124.0120 552.6438 38.3047 99.7067 59.5848 8.4719 13.1020 3.3183 3.0146 9.9318 5.3129 8.9625
temp: 298.150 k
press: 1.00000 atm
elementType: 35 35 35 16 8 7 6 6 6 6 6 6 6 6 6 6 6 1 1 1 1 1 1
symmnumber: 1
zpe: 370294.8 jmol-1
zpe.correction: 0.141038 hartree
zpe.thermalcorrener: 0.157719 hartree
zpe.thermalcorrenthalpy: 0.158664 hartree
zpe.thermalcorrgfe: 0.090712 hartree
zpe.sumelectzpe: -989.983884 hartree
zpe.sumelectthermal: -989.967203 hartree
zpe.sumelectthermalent: -989.966258 hartree
zpe.sumelectthermalfe: -990.034210 hartree
dipole: -1.4881 2.9160 0.0288
dipole: 3.2739
quadrupole: -143.5049 -126.8444 -138.2096
quadrupole: 1.8889 0.0171 0.0652
quadrupole: -7.3186 9.3419 -2.0233 1.8889 0.0171 0.0652
hfenergy: -990.1249221 hartree
pointgroup: C01 [X(C11H6Br3N1O1S1)]
dipole: -0.5549862 -1.1622727 -0.0118966 debye
dipolederiv: -0.4248798 0.2731019 -0.0012181 0.2988654 -0.1498486 0.0008198 -0.0013598 0.0008487 0.039224 -0.5079069 -0.3182515 -0.0000981 -0.469256 -0.236665 0.0001968 0.0000142 0.0003601 0.0989606 -0.9541705 -0.0127698 -0.0008544 -0.027122 -0.0629736 -0.0002258 -0.0011795 -0.0003209 -0.0327952 -0.3837715 0.1266439 -0.0010764 0.0595268 -0.291684 0.0012575 0.0014092 0.0008113 0.1703916 -0.912084 -0.2205136 -0.000569 0.2156461 -0.9090457 -0.0041741 0.0034984 -0.0038912 -0.3373811 -1.997131 0.2312019 0.0023255 0.8127286 -0.3890899 0.0000279 0.0077184 0.0000176 -0.3011055 1.3529312 -0.0394785 0.0004003 0.1373247 0.0039176 -0.0010048 0.0011908 -0.000811 0.106734 -0.9116543 -0.1533913 -0.0005247 0.0919493 0.3419705 -0.0024185 -0.002644 -0.0009433 -0.1977611 2.5384946 0.1568866 -0.0016095 -0.9191484 1.0524137 0.0073735 -0.0102762 0.0063413 0.2706025 -0.2272541 -0.0074378 -0.000005 -0.0161191 -0.0531579 0.0009746 -0.0000003 0.0008041 -0.1523123 -0.165758 0.0129659 0.0002105 0.0375111 0.0281279 0.0022523 0.0000019 0.002029 -0.198029 0.0843018 0.2864347 -0.0008458 0.1792001 -0.2009444 0.0006493 -0.0009509 0.0008709 -0.02157 0.5793683 -0.7871149 0.0027075 -0.9069641 -0.0038893 -0.0008006 0.0034516 -0.0012409 -0.0779374 -0.3737737 0.0697696 0.0005223 0.1029639 0.0912456 0.0014851 0.0007271 0.0016107 -0.0808477 -0.3999444 -0.0565652 -0.0006685 -0.1518008 0.0709476 0.0011986 -0.0016355 0.0012561 -0.078823 1.4629383 0.0396554 0.0017603 0.0864062 -0.0398021 0.0010043 0.0024517 0.0010039 -0.1446015 0.5893356 0.4746719 0.0007745 0.6661415 0.5565472 -0.0011175 -0.0006945 -0.0012073 -0.2203952 0.2259818 -0.0190788 -0.0001104 -0.0949031 0.088217 -0.0018694 -0.0011277 -0.0019584 0.2990933 0.1910394 0.0569467 0.0003855 0.0193892 0.0793944 -0.0009863 0.0003007 -0.0007874 0.1826731 -0.0094861 -0.1095081 -0.0012129 -0.0985977 -0.0290866 -0.0019882 -0.0010829 -0.0018672 0.1699688 0.1579218 -0.0137593 -0.0001366 -0.0259475 0.0650244 0.0003445 0.0004449 0.00003 0.1884907 0.0458005 -0.0589379 -0.0006665 -0.0759371 -0.0071141 -0.0015788 -0.000917 -0.00153 0.1563255 0.0397011 0.0685281 0.0005096 0.0781428 -0.0045049 -0.0014203 0.0006595 -0.001426 0.1610949 unknown
polarizability: 420.5688057|5.9965308|190.1825|0.2341164|0.3310691|65.406582 unknown
InChI: InChI=1S/C11H6Br3NOS/c12-6-1-3-7(4-2-6)15-11(16)9-5-8(13)10(14)17-9/h1-5,15H
charge 0 multiplicity 1
23 atoms
Br -5.884685 1.450475 -0.008692
Br -5.571294 -2.199634 -0.00044
Br 6.707666 -0.028535 0.002648
S  -2.435031 -1.486857 0.003324
O  -0.166221 1.92209 0.010234
N  0.511852 -0.332708 -0.006357
C  1.928724 -0.201087 -0.003914
C  -1.866577 0.245908 0.000156
C  -0.445194 0.682717 0.001948
C  2.594632 1.054259 0.008398
C  2.693103 -1.399365 -0.014265
C  -2.94704 1.117265 -0.003159
C  -4.225159 0.462313 -0.004045
C  4.005059 1.096558 0.010289
C  4.100896 -1.355768 -0.012384
C  4.746523 -0.101598 -0.000064
C  -4.149483 -0.92507 -0.001151
H  0.171747 -1.298301 -0.016957
H  2.010892 1.975808 0.016117
H  2.190495 -2.374837 -0.023785
H  -2.808159 2.199795 -0.004833
H  4.515874 2.063532 0.019771
H  4.680679 -2.282761 -0.020341
