program: Gaussian 09
title: 000286731
version: EM64L-G09RevD.01
frameworkgroup: C1[X(C8H4Br2Cl4)]
method: RPBEPBE
basis: SDD
operation: Freq
keyword: #p
keyword: freq=noraman
keyword: PBEPBE/SDD
title: #p freq=noraman PBEPBE/SDD
converged: NO YES NO NO
title: Mulliken charges:
elementType: Br Br Cl Cl Cl Cl C C C C C C C C H H H H
charge: 0.015009 0.015009 0.021398 0.050206 0.050205 0.063202 0.780256 0.780257 -0.560853 -0.324649 -0.324650 -0.088019 -0.853700 -0.853701 0.307958 0.307058 0.307058 0.307958
chargesum: 0.00000
title: Mulliken charges with hydrogens summed into heavy atoms:
elementType: Br Br Cl Cl Cl Cl C C C C C C C C
charge: 0.015009 0.015009 0.021398 0.050206 0.050205 0.063202 0.780256 0.780257 -0.560853 -0.324649 -0.324650 -0.088019 -0.238685 -0.238685
polarizability: 2.02281757e+02 -2.32447174e-03 1.89174644e+02 -1.28013299e-03 -2.31980857e+00 1.01039559e+02
1716.lowfreq: -1.8385 0.0015 0.0018 0.0025 1.9267 2.0656 28.4069 36.4234 46.6781
frequency: 28.3973 36.4180 46.6769 50.1411 69.9256 100.3049 107.0386 199.5276 214.1740 214.6845 223.2313 310.9778 327.4472 336.0862 340.0184 346.2522 350.9499 410.4858 509.4500 519.6910 542.1526 577.5336 631.0980 666.7966 677.6640 707.6237 792.5720 861.4232 881.6190 899.2789 1010.3874 1076.6610 1122.2804 1134.0647 1221.2700 1224.3229 1263.4763 1349.0162 1364.4470 1372.0254 1449.8836 1453.6708 1530.9117 1556.6262 3088.6710 3088.8130 3173.4019 3173.5628
redmass: 42.7148 22.1180 28.3708 21.9415 34.0658 30.4426 26.1288 15.6087 29.7156 23.9865 22.9141 20.9801 7.9099 3.7550 7.0420 4.0268 8.2502 9.0190 7.0257 8.6399 7.7258 3.5777 9.4502 5.9944 7.8293 10.0251 10.1689 7.3890 1.5991 1.5800 6.5016 7.4260 1.1940 1.1836 1.1463 1.1876 6.8631 8.1544 6.3409 7.5920 1.1105 1.1257 9.4352 10.7438 1.0572 1.0573 1.1105 1.1105
irintensity: 0.0475 0.0080 0.2108 0.3000 0.0821 0.1916 1.3526 0.2883 0.0273 0.0202 0.3672 1.0951 0.7588 1.9115 3.1718 2.8828 0.6484 28.9129 17.1299 25.3642 61.9943 0.4308 7.0871 10.8130 0.0722 11.8528 0.0674 3.6853 41.3078 16.0720 91.4172 16.6647 14.2290 0.3596 19.7268 45.3955 93.3498 3.0287 51.0293 28.7258 28.6204 22.3531 14.6880 73.5933 2.3044 8.9407 0.1775 0.8117
temp: 298.150 k
press: 1.00000 atm
elementType: 35 35 17 17 17 17 6 6 6 6 6 6 6 6 1 1 1 1
symmnumber: 1
zpe: 255002.8 jmol-1
zpe.correction: 0.097125 hartree
zpe.thermalcorrener: 0.112109 hartree
zpe.thermalcorrenthalpy: 0.113053 hartree
zpe.thermalcorrgfe: 0.050204 hartree
zpe.sumelectzpe: -2173.384044 hartree
zpe.sumelectthermal: -2173.369061 hartree
zpe.sumelectthermalent: -2173.368116 hartree
zpe.sumelectthermalfe: -2173.430965 hartree
dipole: 0.0000 0.8341 3.3115
dipole: 3.4149
quadrupole: -130.0435 -132.0246 -123.5994
quadrupole: 0.0000 0.0000 -2.5650
quadrupole: -1.4876 -3.4687 4.9564 0.0000 0.0000 -2.5650
hfenergy: -2173.4811691 hartree
pointgroup: C01 [X(C8H4Br2Cl4)]
dipole: -0.0000106 0.1641621 1.3334739 debye
dipolederiv: -0.3553942 -0.1712442 -0.0910135 -0.223076 -0.2003953 -0.0917672 -0.3546279 -0.2321051 -0.3316323 -0.3554726 0.1712412 0.0910592 0.2230241 -0.2003299 -0.0917654 0.3547132 -0.232131 -0.331699 -0.0981759 0.0000615 -0.0000221 0.0000616 -0.6606576 0.1498509 -0.0000135 0.1234462 -0.0479385 -0.5532679 -0.3244525 -0.0057746 -0.2791943 -0.222173 0.011735 0.038076 0.0300301 0.0015094 -0.5534254 0.3245071 0.0058488 0.279122 -0.2220924 0.0116994 -0.0380741 0.0300115 0.0015082 0.0027731 0.0001685 0.0000374 0.0000849 -0.6594143 0.0597498 -0.0000353 0.1046654 0.0088172 -0.3013166 0.0783261 -0.0191469 0.1338142 -0.3978112 0.0399574 0.092161 0.1261975 -0.0363684 -0.3012424 -0.0781228 0.0192306 -0.1338113 -0.3979073 0.0399434 -0.0921958 0.1261758 -0.0363649 0.2455255 -0.0001387 0.0000094 -0.000079 0.960267 -0.2974702 0.0000184 -0.1766366 -0.0339756 0.8358266 0.4212204 0.001131 0.3351025 0.250323 0.0013855 -0.0463001 -0.066493 -0.0505844 0.8360088 -0.4211031 -0.001162 -0.334966 0.2501663 0.0014028 0.046293 -0.0665809 -0.0506385 -0.5524945 -0.0004364 -0.0001116 -0.0001872 0.9525025 -0.0747251 0.0000525 -0.1470245 0.0040386 0.4672241 0.2946407 0.2225474 0.3232832 0.2009094 0.2044163 0.3649484 0.2763895 0.4952417 0.4673098 -0.2947413 -0.2226847 -0.323184 0.2007401 0.2043582 -0.3650351 0.2762471 0.4952227 0.0159254 -0.0174214 -0.0206669 0.0643083 0.0575328 -0.0959758 -0.048473 -0.0900057 -0.0062576 0.092129 0.0078051 -0.086557 -0.0721049 0.0153626 0.011558 -0.0783185 0.0038145 -0.0373489 0.0921246 -0.0078271 0.0865319 0.0721239 0.0153074 0.0115428 0.0783087 0.0038831 -0.0373258 0.0159424 0.017517 0.0207437 -0.0643219 0.05767 -0.0958957 0.0485019 -0.0898838 -0.0062039 unknown
polarizability: 202.2817569|-0.0003772|188.3913019|-0.0034063|8.5911433|101.8229005 unknown
InChI: InChI=1S/C8H4Br2Cl4/c9-1-3-5(11)4(2-10)7(13)8(14)6(3)12/h1-2H2
charge 0 multiplicity 1
18 atoms
Br -3.211935 -1.834013 -1.33554
Br 3.212383 -1.833223 -1.335588
Cl 0.000367 -2.887502 0.717086
Cl 2.774559 1.876216 -0.037151
Cl -2.77501 1.875532 -0.037105
Cl -0.00042 3.455838 -0.277038
C  -1.251626 -0.429694 0.347536
C  1.251752 -0.429385 0.347515
C  0.000145 -1.08862 0.45559
C  1.217955 0.97427 0.124189
C  -1.218181 0.973969 0.124211
C  -0.000201 1.680401 0.008941
C  -2.549002 -1.164304 0.482433
C  2.549311 -1.163673 0.482393
H  -3.363195 -0.522368 0.840506
H  -2.45604 -2.077461 1.083204
H  2.456586 -2.076852 1.083168
H  3.36335 -0.521534 0.840451
