program: Gaussian 09
title: 000286728
version: EM64L-G09RevD.01
frameworkgroup: C1[X(C8H6Br2Cl2)]
method: RPBEPBE
basis: SDD
operation: Freq
keyword: #p
keyword: freq=noraman
keyword: PBEPBE/SDD
title: #p freq=noraman PBEPBE/SDD
converged: NO YES NO NO
title: Mulliken charges:
elementType: Br Br Cl Cl C C C C C C C C H H H H H H
charge: -0.007429 -0.007429 0.018155 0.018154 0.619449 0.619450 -0.272203 -0.272203 -0.354586 -0.354584 -0.847640 -0.847641 0.248593 0.248592 0.304924 0.290737 0.290737 0.304924
chargesum: 0.00000
title: Mulliken charges with hydrogens summed into heavy atoms:
elementType: Br Br Cl Cl C C C C C C C C
charge: -0.007429 -0.007429 0.018155 0.018154 0.619449 0.619450 -0.272203 -0.272203 -0.105993 -0.105992 -0.251980 -0.251980
polarizability: 1.95560291e+02 -1.88241949e-02 1.28379915e+02 -1.56591689e-02 -8.46849038e+00 1.03887225e+02
1716.lowfreq: -8.8961 -5.8649 -3.2923 -0.0022 -0.0011 0.0004 29.2267 35.4711 41.2200
frequency: 29.1322 35.4654 41.2200 66.3210 109.3314 144.5667 209.3867 249.1682 265.1891 295.5607 311.6568 374.8749 444.6916 469.8150 472.6410 506.4158 521.0800 566.5132 653.8611 713.7797 752.3516 800.8216 838.9710 861.3612 885.2575 926.8949 964.5449 1064.7742 1099.9711 1128.3758 1173.4719 1213.3627 1214.9371 1249.2992 1264.8288 1369.8443 1376.9168 1452.1523 1453.4294 1463.8844 1548.0897 1602.6207 3077.4665 3077.5955 3140.2209 3160.9691 3163.8569 3164.0984
redmass: 30.2784 9.4315 14.3682 22.6263 12.2182 7.9960 25.5438 7.6810 4.1041 2.5177 8.8418 9.5663 6.6305 2.9480 7.2987 4.3084 7.1736 7.2029 3.8580 7.1215 6.4801 6.1152 1.4640 1.6180 1.5021 4.0972 1.3857 3.2290 1.2359 1.2380 1.1841 1.1574 1.2128 5.4423 1.7164 8.4144 3.3779 1.1240 1.1351 3.4455 6.4630 7.4405 1.0575 1.0575 1.0880 1.0990 1.1108 1.1095
irintensity: 0.1855 0.1432 0.4677 0.5538 3.7545 0.9763 0.0404 0.7343 0.0583 5.0461 6.4593 20.5693 1.2647 0.0346 12.6551 11.0024 37.8780 24.9172 32.9481 35.9264 1.1883 7.4268 22.4157 6.1484 0.0047 47.5095 0.0161 39.5289 2.1241 13.1680 2.9213 38.1571 35.4954 19.1310 35.3296 1.8300 53.3446 8.1254 12.9669 2.1342 7.4545 1.7774 5.6050 16.9127 4.2021 5.9552 0.0041 2.0899
temp: 298.150 k
press: 1.00000 atm
elementType: 35 35 17 17 6 6 6 6 6 6 6 6 1 1 1 1 1 1
symmnumber: 1
zpe: 304874.5 jmol-1
zpe.correction: 0.116121 hartree
zpe.thermalcorrener: 0.128641 hartree
zpe.thermalcorrenthalpy: 0.129585 hartree
zpe.thermalcorrgfe: 0.072568 hartree
zpe.sumelectzpe: -1254.618926 hartree
zpe.sumelectthermal: -1254.606406 hartree
zpe.sumelectthermalent: -1254.605462 hartree
zpe.sumelectthermalfe: -1254.662479 hartree
dipole: 0.0000 -0.7328 4.4592
dipole: 4.5190
quadrupole: -108.5907 -102.6977 -97.8974
quadrupole: 0.0000 0.0000 -4.0198
quadrupole: -5.5288 0.3642 5.1646 0.0000 0.0000 -4.0198
hfenergy: -1254.735047 hartree
pointgroup: C01 [X(C8H6Br2Cl2)]
dipole: -0.0000137 -0.8077055 -1.58385 debye
dipolederiv: -0.5198081 0.0580074 -0.132835 0.088934 -0.1167265 0.0528646 -0.5137461 0.0913916 -0.3970553 -0.5202825 -0.0580614 0.1330134 -0.0885795 -0.1166427 0.0526236 0.5141451 0.0914763 -0.3973107 -0.2234557 -0.2779006 -0.0020702 -0.275896 -0.4984858 -0.0231048 -0.0332933 -0.0506796 -0.0204927 -0.2233672 0.2778811 0.002046 0.275828 -0.4985676 -0.0230329 0.0333111 -0.050667 -0.0205183 -0.2082372 -0.0347029 0.0125199 -0.1300659 -0.1124447 0.0186183 0.1424003 -0.0070948 -0.0785566 -0.2084957 0.0347795 -0.0126505 0.1299028 -0.1124392 0.0185895 -0.1425014 -0.0070754 -0.0786611 0.1813018 0.5473535 0.0381005 0.549405 0.6174759 -0.016428 0.0456461 0.0872724 -0.0319457 0.18099 -0.5473394 -0.0380411 -0.5492291 0.6175728 -0.0164306 -0.0456247 0.0871752 -0.0317223 -0.0347229 -0.0764372 -0.0226703 -0.0460374 0.01967 0.0539796 -0.0228398 -0.0016084 -0.1121799 -0.0347087 0.076358 0.0228572 0.0459071 0.0196102 0.0541366 0.0227984 -0.0015968 -0.1122242 0.7171487 -0.1530387 0.2783599 -0.0730256 0.0714544 -0.0704121 0.5040829 -0.1151669 0.5868858 0.7180137 0.1530465 -0.2784871 0.0727633 0.0713302 -0.0700941 -0.5045082 -0.1153211 0.5874181 0.0235355 0.0750994 0.0256004 0.0675009 -0.0201345 -0.019104 -0.0002218 -0.0216831 0.1397959 0.0235722 -0.0750611 -0.0257083 -0.0673628 -0.0200193 -0.0193524 0.0002921 -0.0216573 0.1397312 0.0359355 0.0089458 -0.0502773 -0.0732329 0.033153 0.067403 -0.0682277 0.0689233 -0.0211015 0.028389 0.0112233 -0.0508658 0.0828452 0.0060066 -0.0637924 -0.0493126 -0.0513533 -0.0653462 0.0283884 -0.011204 0.0508113 -0.0829126 0.0060959 -0.0639886 0.0493003 -0.0512822 -0.0655484 0.0358031 -0.008949 0.050297 0.0732556 0.0330914 0.0675245 0.0682994 0.068947 -0.0211681 unknown
polarizability: 195.5602927|0.0102162|131.0216237|-0.0191879|-0.1847213|101.2455151 unknown
InChI: InChI=1S/C8H6Br2Cl2/c9-3-5-1-2-6(4-10)8(12)7(5)11/h1-2H,3-4H2
charge 0 multiplicity 1
18 atoms
Br 3.708168 -0.717262 1.482706
Br -3.708241 -0.716922 1.482591
Cl 1.607396 2.358818 0.017947
Cl -1.607137 2.358969 0.0179
C  1.438492 -0.402978 -0.376545
C  -1.438481 -0.402842 -0.37659
C  0.705958 0.802529 -0.205292
C  -0.705838 0.802595 -0.205314
C  0.701414 -1.604815 -0.545728
C  -0.70151 -1.604748 -0.545751
C  2.933397 -0.437709 -0.403227
C  -2.933388 -0.437433 -0.403318
H  1.249951 -2.544613 -0.668834
H  -1.250133 -2.544495 -0.668874
H  3.391421 0.504467 -0.73074
H  3.323278 -1.29388 -0.970143
H  -3.323332 -1.293566 -0.970249
H  -3.391315 0.504786 -0.73084
