program: Gaussian 09
title: 000027495
version: EM64L-G09RevD.01
frameworkgroup: C1[X(C17H20N4O2)]
method: RPBEPBE
basis: SDD
operation: Freq
keyword: #p
keyword: freq=noraman
keyword: PBEPBE/SDD
title: #p freq=noraman PBEPBE/SDD
converged: YES YES NO NO
title: Mulliken charges:
elementType: O O N N N N C C C C C C C C C C C C C C C C C H H H H H H H H H H H H H H H H H H H H
charge: -0.277344 -0.230028 -0.375694 -0.236510 -0.404314 -0.003016 -0.517744 0.494551 -0.545766 -0.359543 0.262740 -0.531048 0.450836 -0.462650 -0.398784 -0.208630 -0.810766 0.189122 0.291078 -0.291465 -0.313591 -0.322618 -0.327941 0.226916 0.266206 0.223381 0.241690 0.235991 0.234348 0.305055 0.247256 0.234010 0.275834 0.233867 0.226128 0.226659 0.238288 0.224889 0.298552 0.271359 0.229012 0.246127 0.243559
chargesum: 0.00000
title: Mulliken charges with hydrogens summed into heavy atoms:
elementType: O O N N N N C C C C C C C C C C C C C C C C C
charge: -0.277344 -0.230028 -0.070640 0.039324 -0.105762 -0.003016 -0.024621 0.494551 -0.080695 0.110796 0.262740 -0.283792 0.450836 -0.228641 -0.164918 0.017498 -0.120930 0.189122 0.291078 -0.020106 -0.084580 -0.076490 -0.084382
polarizability: 2.82603339e+02 2.38888159e+01 1.95741220e+02 1.68527255e+01 -1.05950043e-02 1.75395699e+02
1716.lowfreq: -9.6960 -6.3119 -2.1532 -0.0005 0.0006 0.0011 4.8316 7.2120 14.7877
frequency: -7.7417 6.5560 14.7203 28.9583 30.4539 35.7602 39.2780 53.5385 85.7453 88.4510 119.7411 128.3699 175.0052 191.9754 203.1113 212.3867 230.5784 271.1061 276.1015 299.4008 357.2605 364.3016 369.7817 385.1657 424.3052 441.7810 464.4137 507.2874 511.8871 530.6277 559.9565 584.4261 599.5006 615.8437 624.7565 659.9020 670.1842 697.8180 706.0270 707.7997 740.1840 755.0002 793.5785 808.1596 837.2147 863.4998 881.5539 890.8408 901.3872 912.9778 926.7493 957.7705 966.4986 983.9153 985.4625 989.7609 997.5054 1005.6520 1010.5937 1029.4503 1048.7164 1057.6293 1067.6041 1084.2082 1088.6780 1095.0170 1102.9523 1166.6126 1169.7181 1183.0062 1205.0786 1220.7355 1225.7984 1229.7170 1261.0960 1262.7505 1277.2489 1299.6946 1301.2164 1311.7829 1324.2740 1351.8982 1366.4253 1383.1042 1397.9576 1398.5929 1431.3773 1431.6598 1447.5605 1460.9496 1471.3614 1473.9315 1477.0931 1484.3599 1488.6659 1493.2276 1519.9466 1547.5211 1580.5111 1599.8526 1611.7940 1619.9974 1627.6242 2932.0135 2976.3359 2977.3423 2983.2821 3041.4516 3042.3655 3057.9667 3063.8406 3086.2511 3115.7480 3120.1912 3125.5014 3126.4889 3140.3714 3149.8056 3152.8972 3172.8889 3405.2530 3425.9327 3548.4561
redmass: 4.2763 4.6339 4.9874 5.0064 5.1684 1.1019 5.8481 5.9712 2.2170 3.6502 4.0036 5.7442 4.1745 4.2489 4.8166 3.4311 5.0409 2.9650 3.7699 4.6169 3.5569 2.6340 4.3135 4.3904 2.8176 2.9722 2.7016 4.3689 4.4836 4.3128 2.1172 1.5522 1.6619 1.7087 3.2677 6.6894 5.2117 5.1659 3.0255 2.4257 3.6977 2.7999 1.4894 1.3218 1.7371 5.8952 2.8402 1.2602 1.3133 1.5585 2.5192 3.6507 1.7439 1.3635 1.4541 5.7179 2.0703 2.3080 2.4075 2.5757 1.5781 2.7375 2.1654 1.9995 2.4241 2.3205 1.8520 1.6641 1.7093 1.0910 2.3638 1.3955 1.3006 1.4387 2.8648 2.6450 1.1718 6.3614 1.3576 1.3834 1.5140 1.5447 1.5020 5.2942 1.2265 1.8478 1.2984 2.0527 1.0945 1.8808 1.3569 1.0744 1.2441 1.8092 1.6950 1.1203 1.4521 7.4064 5.5810 5.9025 6.3640 6.1072 8.5310 1.0685 1.0386 1.0632 1.0614 1.0991 1.0922 1.0951 1.0994 1.0998 1.0867 1.0909 1.0917 1.0875 1.0896 1.0974 1.0991 1.0966 1.0765 1.0755 1.0778
irintensity: 0.3009 0.4783 1.7023 1.4425 1.9486 0.6683 3.7554 7.5839 0.8765 4.8982 6.3555 8.5494 0.1000 16.5028 3.2707 3.6321 0.7887 3.4764 7.7240 0.9331 11.0481 1.0352 8.4633 6.6546 5.1356 3.9342 35.3306 7.3128 4.0552 2.5023 16.5510 134.6042 45.9909 85.5682 11.4809 0.8040 27.3767 8.7249 7.9616 29.6999 8.9369 12.7532 45.8963 4.2515 34.5295 17.3982 1.3119 3.4969 1.2526 3.6949 0.2118 1.6459 1.8671 0.0644 0.8973 0.3047 5.6269 0.9638 6.6850 4.8392 16.0414 39.9565 12.4096 6.3446 7.8085 6.2586 17.2247 14.3541 36.6303 0.8058 21.3228 1.6442 2.1387 100.6534 25.0574 97.0473 6.8194 1.4208 13.7396 42.4581 2.6717 6.1993 19.5498 2.1360 12.8390 13.5674 37.4635 21.0440 16.2792 2.4355 40.2090 13.3604 44.0900 97.6776 159.2107 3.6815 83.3427 30.7929 6.8686 8.7391 198.2191 22.0295 127.0181 32.9103 28.7189 17.0757 41.3770 7.8887 10.9317 20.3893 36.7002 17.9242 1.8594 14.9254 25.0283 8.7439 25.6381 18.1751 29.4602 5.9517 43.2469 2.1351 20.1723
temp: 298.150 k
press: 1.00000 atm
elementType: 8 8 7 7 7 7 6 6 6 6 6 6 6 6 6 6 6 6 6 6 6 6 6 1 1 1 1 1 1 1 1 1 1 1 1 1 1 1 1 1 1 1 1
symmnumber: 1
zpe: 907997.6 jmol-1
zpe.correction: 0.345838 hartree
zpe.thermalcorrener: 0.367639 hartree
zpe.thermalcorrenthalpy: 0.368583 hartree
zpe.thermalcorrgfe: 0.288802 hartree
zpe.sumelectzpe: -1027.568819 hartree
zpe.sumelectthermal: -1027.547019 hartree
zpe.sumelectthermalent: -1027.546074 hartree
zpe.sumelectthermalfe: -1027.625855 hartree
dipole: -3.2971 -1.5813 -0.1182
dipole: 3.6586
quadrupole: -140.3933 -127.4718 -145.6229
quadrupole: -13.6816 11.6154 5.2645
quadrupole: -2.5639 10.3575 -7.7936 -13.6816 11.6154 5.2645
hfenergy: -1027.9146574 hartree
pointgroup: C01 [X(C17H20N4O2)]
dipole: -1.280853 0.6565086 0.0179379 debye
polarizability: 281.0678617|-27.0353815|196.982588|-16.1467717|-0.6526326|175.689808 unknown
InChI: InChI=1S/C17H20N4O2/c1-13-3-2-4-14(11-13)12-19-16(22)7-10-20-21-17(23)15-5-8-18-9-6-15/h2-6,8-9,11,19-21H,7,10,12H2,1H3
charge 0 multiplicity 1
43 atoms
O  -1.782784 2.232232 -1.877004
O  3.479482 0.229224 2.048911
N  -2.973273 1.875158 0.093789
N  1.876645 1.887987 0.372119
N  3.03221 1.200526 -0.045568
N  7.115439 -1.811448 -0.908644
C  -4.284848 1.727585 -0.564792
C  -5.00824 0.446072 -0.165907
C  -0.547142 2.288339 0.24582
C  0.652848 1.561368 -0.39472
C  -1.808733 2.127071 -0.610472
C  -4.353461 -0.808381 -0.250583
C  -5.014724 -2.013945 0.088467
C  -6.352779 0.492736 0.27438
C  -6.363083 -1.94321 0.529131
C  -7.027218 -0.700744 0.618533
C  -4.30989 -3.353476 -0.042348
C  3.738411 0.362765 0.821764
C  4.89364 -0.371165 0.169059
C  5.981529 -0.757748 0.98985
C  4.9310 -0.74019 -1.200171
C  7.060269 -1.461904 0.413723
C  6.051369 -1.453174 -1.686164
H  -4.922494 2.604138 -0.33692
H  -4.070474 1.749076 -1.650156
H  -0.325463 3.374354 0.304653
H  -0.691436 1.926574 1.279695
H  0.706027 1.846495 -1.469806
H  0.505131 0.468155 -0.342238
H  -2.929701 1.76745 1.108947
H  -3.310685 -0.842714 -0.591694
H  -6.869493 1.457658 0.349537
H  2.048279 2.896503 0.487692
H  -6.890154 -2.865108 0.803899
H  -8.066642 -0.661148 0.963393
H  -3.220076 -3.256025 0.105823
H  -4.466404 -3.786379 -1.049591
H  -4.691071 -4.085491 0.691309
H  3.374357 1.321304 -1.008624
H  5.961486 -0.514471 2.05625
H  4.100259 -0.524498 -1.881413
H  7.919269 -1.766956 1.021317
H  6.104919 -1.759697 -2.736948
