program: Gaussian 09
title: 000286711
version: EM64L-G09RevD.01
frameworkgroup: C1[X(C12H14O5)]
method: RPBEPBE
basis: SDD
operation: Freq
keyword: #pfreq=noraman
keyword: PBEPBE/SDD
title: #p freq=noraman PBEPBE/SDD
converged: YES YES NO NO
title: Mulliken charges:
elementType: O O O O O C C C C C C C C C C C C H H H H H H H H H H H H H H
charge: -0.281191 -0.264392 -0.285461 -0.286897 -0.454476 0.060583 0.217453 0.536572 0.114499 -0.008113 -0.589629 -0.200159 -0.339792 -0.136562 -0.512534 -0.523520 -0.419098 0.253175 0.227444 0.242280 0.265758 0.229011 0.222143 0.233657 0.253959 0.262039 0.227690 0.217103 0.193686 0.203979 0.340791
chargesum: 0.00000
title: Mulliken charges with hydrogens summed into heavy atoms:
elementType: O O O O O C C C C C C C C C C C C
charge: -0.281191 -0.264392 -0.285461 -0.286897 -0.113685 0.060583 0.217453 0.536572 0.114499 -0.008113 -0.336454 0.269565 -0.074034 0.092448 0.197225 0.183313 -0.021433
polarizability: 2.48230188e+02 -1.68518302e+00 1.66901649e+02 -4.34889865e+00 -3.55515934e-01 8.20314240e+01
1716.lowfreq: -1.8743 -0.0001 0.0001 0.0005 4.7449 9.0416 29.7299 43.2228 63.9766
frequency: 29.6689 43.2038 63.9723 81.9516 90.7686 105.4462 108.0520 132.4185 146.1614 168.5627 182.4640 208.4758 225.7945 232.7885 236.1695 278.2358 300.7832 313.3489 336.5722 348.7764 398.5461 452.2938 489.2021 509.0482 579.1416 595.8937 643.4668 647.7859 695.9470 740.1641 770.8724 832.7110 844.7725 857.2168 867.1568 908.6461 929.6806 951.8228 956.8303 994.9259 1010.2473 1012.9871 1061.2837 1078.5104 1095.4598 1110.3050 1114.5394 1137.9998 1152.3602 1158.1997 1178.1008 1182.1013 1201.0240 1225.2108 1287.9876 1295.5176 1308.9937 1360.7081 1383.0066 1396.8662 1414.1062 1434.6202 1442.5676 1456.0300 1459.7331 1463.7025 1466.6171 1471.8326 1480.1902 1482.4405 1603.7940 1621.1464 1667.0387 2920.9011 2973.9269 2982.9575 2986.0307 2987.2382 3081.0711 3090.6369 3113.3262 3120.9145 3123.8068 3128.2758 3131.7652 3186.9666 3550.8502
redmass: 4.1987 2.7254 4.5161 3.2426 2.8900 2.4012 3.4532 2.1051 1.9565 1.4064 2.1279 3.5962 2.1586 3.7292 1.5692 5.4529 4.0656 5.0977 4.1854 5.1534 6.7738 4.2301 6.5883 6.6248 4.5979 4.7028 6.1485 8.2707 8.9312 6.7381 4.5338 5.0488 1.7091 4.5677 2.2303 7.3087 4.4605 6.1697 2.4244 5.8884 1.1324 6.1686 4.2819 1.5273 2.2866 1.2397 1.2464 1.0917 1.4435 1.4871 1.1214 2.9786 1.6788 1.3124 1.6565 1.6788 2.0562 1.2885 1.8965 3.3267 2.3322 1.3034 1.5104 1.1565 1.0616 2.2966 1.1320 1.0513 1.1789 1.0538 8.8748 9.4789 6.0910 1.0594 1.0330 1.0626 1.0334 1.1009 1.0998 1.1020 1.0930 1.1059 1.1041 1.0865 1.1041 1.0923 1.0665
irintensity: 1.7648 4.8148 2.0154 9.5638 2.6208 9.1285 4.5912 6.9586 6.7559 4.0837 2.7138 0.4815 71.3883 15.8627 65.6710 0.2730 15.9500 3.8942 2.6518 6.3431 2.6296 26.4705 3.6022 1.8773 6.2874 8.5655 4.6060 0.2398 4.8506 0.6538 8.8224 29.0851 8.4923 14.4045 23.3812 22.7538 62.6260 33.7731 33.1101 292.3086 55.3605 14.0849 83.9898 14.4488 85.1929 5.2770 4.8041 2.2936 3.1790 40.6996 39.2049 6.3736 40.4675 23.4945 74.1676 37.5252 126.2910 17.8649 42.3242 150.6939 2.0668 16.5717 62.9279 40.7132 10.6948 59.7185 8.6239 28.2147 5.2743 14.9145 50.8834 4.8208 9.9762 79.4426 80.5258 101.3240 93.8647 50.1156 31.7484 31.1599 10.2513 28.4025 20.0226 20.7853 19.6571 1.8680 7.0085
temp: 298.150 k
press: 1.00000 atm
elementType: 8 8 8 8 8 6 6 6 6 6 6 6 6 6 6 6 6 1 1 1 1 1 1 1 1 1 1 1 1 1 1
symmnumber: 1
zpe: 627403.3 jmol-1
zpe.correction: 0.238965 hartree
zpe.thermalcorrener: 0.256788 hartree
zpe.thermalcorrenthalpy: 0.257732 hartree
zpe.thermalcorrgfe: 0.192221 hartree
zpe.sumelectzpe: -840.413444 hartree
zpe.sumelectthermal: -840.395621 hartree
zpe.sumelectthermalent: -840.394677 hartree
zpe.sumelectthermalfe: -840.460188 hartree
dipole: -1.8148 0.4995 -1.4780
dipole: 2.3932
quadrupole: -72.3062 -93.7619 -102.7013
quadrupole: 5.3847 -4.6608 5.4840
quadrupole: 17.2836 -4.1721 -13.1115 5.3847 -4.6608 5.4840
hfenergy: -840.6524088 hartree
pointgroup: C01 [X(C12H14O5)]
dipole: -0.6267335 -0.2266349 0.6650995 debye
polarizability: 246.0389774|10.0361772|167.7163029|-12.4385808|-7.6021496|83.4079807 unknown
InChI: InChI=1S/C12H14O5/c1-14-10-8(4-3-5-13)6-9-11(12(10)15-2)17-7-16-9/h3-4,6,13H,5,7H2,1-2H3
charge 0 multiplicity 1
31 atoms
O  -3.206368 0.695331 0.115031
O  -1.831959 2.635869 -0.106637
O  -1.972538 -2.141032 0.486689
O  0.80803 -2.254218 0.559264
O  5.458618 1.285416 -1.125664
C  -1.82841 0.337512 0.218252
C  -1.014358 1.483733 0.084354
C  0.989863 0.146262 0.200272
C  -1.26479 -0.940269 0.360794
C  0.170605 -1.016896 0.340238
C  0.371602 1.430968 0.074113
C  -3.199975 2.182367 0.215893
C  2.454013 -0.019434 0.201866
C  3.386297 0.965231 0.060096
C  -3.289078 -2.091858 1.155829
C  0.579009 -3.298756 -0.465283
C  4.867278 0.720054 0.111184
H  0.966026 2.33956 -0.038217
H  -3.447454 2.469289 1.257327
H  -3.902219 2.589569 -0.525732
H  2.794133 -1.053562 0.338108
H  3.102901 2.015346 -0.093172
H  -3.187728 -1.66926 2.17267
H  -3.611868 -3.141917 1.214117
H  -4.010951 -1.494884 0.574355
H  -0.490102 -3.562934 -0.517336
H  1.17305 -4.163013 -0.13084
H  0.938401 -2.951456 -1.453215
H  5.303819 1.230555 0.99979
H  5.07801 -0.366817 0.192364
H  6.441147 1.352346 -1.011807
