program: Gaussian 09
title: 000286705
version: EM64L-G09RevD.01
frameworkgroup: C1[X(C15H19NO)]
method: RPBEPBE
basis: SDD
operation: Freq
keyword: #p
keyword: freq=noraman
keyword: PBEPBE/SDD
title: #p freq=noraman PBEPBE/SDD
converged: YES YES NO NO
title: Mulliken charges:
elementType: O N C C C C C C C C C C C C C C C H H H H H H H H H H H H H H H H H H H
charge: -0.276056 -0.148202 -0.401300 -0.396016 -0.549558 -0.494953 0.298962 0.039211 -0.378169 0.474238 -0.396086 -0.433253 0.404195 -0.375608 -0.381901 -0.646489 -0.645110 0.209119 0.202851 0.210923 0.203015 0.213462 0.208123 0.225950 0.242079 0.189574 0.326252 0.216067 0.236531 0.235379 0.240408 0.238763 0.216373 0.236268 0.218154 0.236802
chargesum: 0.00000
title: Mulliken charges with hydrogens summed into heavy atoms:
elementType: O N C C C C C C C C C C C C C C C
charge: -0.276056 -0.148202 0.010670 0.017922 -0.127974 -0.026923 0.298962 0.039211 -0.188594 0.474238 -0.069834 -0.217185 0.404195 -0.139078 -0.146522 0.049056 0.046113
polarizability: 3.74509743e+02 -3.14534995e+00 1.66271756e+02 4.17441415e+00 -6.76679650e-01 9.80718980e+01
1716.lowfreq: -14.8402 -8.7453 -0.0008 -0.0007 0.0003 4.2431 21.7718 40.9969 63.8964
frequency: 20.2642 40.8938 63.8779 80.6710 91.0659 107.4505 113.3246 154.1471 189.9013 202.0096 219.7288 250.7785 276.7211 308.9770 341.8597 390.4803 396.9027 425.5100 439.9460 448.5852 475.6562 494.6567 534.2446 550.5315 620.7481 629.6818 643.5556 693.2591 723.6814 745.7855 805.5518 814.8125 821.0484 841.5808 884.0510 888.3595 930.2931 930.4094 941.8226 961.5358 977.1074 997.1539 1026.8135 1055.0703 1074.1287 1086.8051 1105.8751 1108.7744 1110.9773 1123.7157 1141.6015 1151.0636 1164.9216 1202.9737 1219.2634 1243.9055 1258.3745 1259.8442 1262.9675 1314.1641 1322.1183 1335.4241 1337.5064 1347.4270 1363.9929 1373.1123 1424.0648 1431.4762 1439.7738 1451.4113 1457.6603 1462.7467 1464.1033 1466.1654 1476.0222 1477.3792 1490.9564 1499.6224 1508.8502 1524.6493 1544.3797 1596.5114 1630.3166 2941.5150 2944.3789 2952.2126 2960.9240 2975.7362 2978.4413 3011.4407 3016.3330 3018.1439 3034.0461 3037.8408 3043.4689 3058.4798 3096.5099 3107.0662 3110.8666 3147.0859 3161.7575 3165.4028
redmass: 3.5960 3.3642 3.5532 2.7252 2.8393 1.5956 3.2396 2.2874 1.2072 4.3624 3.9700 2.6625 3.8113 2.0647 2.9008 3.5755 3.0243 3.2230 3.2064 4.2010 2.8978 4.0509 2.3569 3.1682 2.9325 4.9683 3.9374 3.8946 4.7007 3.4350 1.3800 2.5674 2.1323 1.5026 1.5906 2.5611 1.5488 2.0527 3.0867 1.4625 2.6812 2.9253 1.2921 1.5028 1.8640 1.5039 1.2435 2.1530 1.3279 1.3085 1.8877 2.0601 1.7140 1.8506 1.2609 1.3043 2.8564 1.7946 1.3049 1.4737 1.4439 1.4844 1.4112 1.5537 2.8155 4.2302 1.5002 1.2407 1.1203 2.8223 1.2113 1.1086 1.0432 1.0886 1.0461 1.0993 1.1295 1.7253 2.4644 2.3417 5.4061 6.3449 6.0980 1.0655 1.0367 1.0391 1.0669 1.0600 1.0634 1.1001 1.1021 1.0944 1.0987 1.0852 1.1021 1.0951 1.0967 1.0945 1.0888 1.0898 1.0933 1.0945
irintensity: 2.6745 2.3589 0.4332 0.6201 1.0535 4.4199 2.0399 0.4990 0.0509 2.6800 1.6276 3.2097 0.8034 1.0754 3.9812 0.6092 2.2827 0.9686 2.2054 7.7643 1.0935 3.5831 18.8170 6.9477 0.3097 2.0659 2.2784 8.8838 1.6080 2.5246 21.9426 18.0720 32.5329 52.3456 3.6621 7.0817 15.0318 16.3422 39.8129 9.4818 15.9156 0.2372 5.2274 25.7420 5.1165 42.7896 0.5073 25.4297 1.9720 6.3114 60.9194 37.0671 13.1044 152.0507 25.7871 15.0103 27.5121 23.2881 14.8983 3.1832 16.2644 14.6173 0.5043 0.8266 176.5924 38.7286 90.1521 78.1508 16.0194 32.8143 27.5547 41.0397 0.1937 13.0115 22.5972 14.7889 12.4966 224.8532 189.2323 291.5923 73.4231 180.8610 355.1091 41.6702 103.0791 148.7148 12.3327 33.3062 61.2790 21.1873 61.1340 27.1374 83.5308 47.9420 54.1578 34.3099 4.2948 50.9359 12.8430 16.0642 15.8616 42.3876
temp: 298.150 k
press: 1.00000 atm
elementType: 8 7 6 6 6 6 6 6 6 6 6 6 6 6 6 6 6 1 1 1 1 1 1 1 1 1 1 1 1 1 1 1 1 1 1 1
symmnumber: 1
zpe: 798909.2 jmol-1
zpe.correction: 0.304288 hartree
zpe.thermalcorrener: 0.320890 hartree
zpe.thermalcorrenthalpy: 0.321834 hartree
zpe.thermalcorrgfe: 0.258877 hartree
zpe.sumelectzpe: -711.688575 hartree
zpe.sumelectthermal: -711.671974 hartree
zpe.sumelectthermalent: -711.671030 hartree
zpe.sumelectthermalfe: -711.733987 hartree
dipole: 3.2801 -2.0892 0.8573
dipole: 3.9823
quadrupole: -64.6889 -99.4563 -105.8030
quadrupole: 5.2140 0.1984 1.0630
quadrupole: 25.2938 -9.4735 -15.8203 5.2140 0.1984 1.0630
hfenergy: -711.9928638 hartree
pointgroup: C01 [X(C15H19N1O1)]
dipole: 1.211628 -0.066831 -0.9910754 debye
polarizability: 372.1795323|-7.4370841|104.8860355|-22.2849907|-19.7439476|161.7878294 unknown
InChI: InChI=1S/C15H19NO/c1-16(2)14-9-7-12(8-10-14)11-13-5-3-4-6-15(13)17/h7-11H,3-6H2,1-2H3
charge 0 multiplicity 1
36 atoms
O  -1.658652 -0.37281 2.098937
N  4.506603 -0.299263 -0.173279
C  -4.864883 -0.157776 -0.682145
C  -5.159722 -0.28503 0.825246
C  -3.637486 0.754483 -0.894365
C  -3.944536 -0.895886 1.55313
C  -2.373699 0.307882 -0.136217
C  -2.572619 -0.282797 1.211364
C  -1.156685 0.507575 -0.785879
C  0.26274 0.284146 -0.518799
C  0.870269 -0.09239 0.72203
C  1.151829 0.479117 -1.627696
C  3.130569 -0.104366 -0.28845
C  2.253846 -0.282173 0.83209
C  2.535132 0.291377 -1.531896
C  5.086645 -0.717252 1.110966
C  5.381614 -0.09942 -1.336535
H  -5.738677 0.265091 -1.214415
H  -4.672183 -1.161245 -1.112075
H  -6.055706 -0.909915 1.003392
H  -5.380524 0.719819 1.238226
H  -3.914833 1.776107 -0.553955
H  -3.408766 0.83981 -1.973772
H  -3.866486 -1.971352 1.283561
H  -4.05418 -0.858152 2.651523
H  -1.297184 0.910279 -1.804818
H  0.223501 -0.218128 1.594183
H  0.730129 0.778858 -2.596455
H  2.661402 -0.561306 1.808027
H  3.155252 0.450579 -2.418482
H  4.664355 -1.682235 1.455705
H  4.910563 0.035041 1.906038
H  6.17479 -0.84399 0.998256
H  5.124244 -0.78744 -2.16731
H  6.42629 -0.292995 -1.047042
H  5.322049 0.938459 -1.721687
