program: Gaussian 09
title: 000286701
version: EM64L-G09RevD.01
frameworkgroup: C1[X(C18H14N2O)]
method: RPBEPBE
basis: SDD
operation: Freq
keyword: #p
keyword: freq=noraman
keyword: PBEPBE/SDD
title: #p freq=noraman PBEPBE/SDD
converged: NO YES NO NO
title: Mulliken charges:
elementType: O N N C C C C C C C C C C C C C C C C C C H H H H H H H H H H H H H H
charge: -0.269508 -0.458882 -0.416839 -0.246107 0.412008 0.114080 0.350459 0.107168 0.413289 0.122702 -0.484127 -0.322293 -0.456947 -0.409869 -0.246604 -0.341908 -0.441986 -0.271074 -0.194056 -0.265214 -0.236603 0.251320 0.299803 0.328971 0.241011 0.289671 0.243685 0.223520 0.233172 0.270125 0.239784 0.233227 0.225293 0.230668 0.232061
chargesum: 0.00000
title: Mulliken charges with hydrogens summed into heavy atoms:
elementType: O N N C C C C C C C C C C C C C C C C C C
charge: -0.269508 -0.159079 -0.087868 0.005213 0.412008 0.114080 0.350459 0.107168 0.413289 0.122702 -0.243116 -0.032622 -0.213262 -0.186348 -0.013432 -0.071783 -0.202202 -0.037847 0.031237 -0.034546 -0.004542
polarizability: 2.94037909e+02 1.25014224e+01 1.97571636e+02 3.29655520e+00 3.51603514e+00 1.55031571e+02
1716.lowfreq: -4.6656 -0.0010 -0.0009 -0.0006 3.8816 6.1485 32.5522 42.2658 56.1233
frequency: 32.5313 42.2475 56.1215 113.9469 144.4142 157.1375 174.9817 186.3956 241.3529 257.4777 267.9079 295.0881 402.8454 413.0933 414.5695 426.8055 472.7114 475.8876 479.7064 498.3913 514.0120 523.1292 533.0605 573.2477 583.0614 593.4534 638.6561 660.0910 682.8345 697.1292 731.7593 750.3989 758.6013 768.9030 777.0655 789.7902 790.8217 820.2226 857.1568 861.4656 885.6663 895.0686 927.2692 961.5197 968.0991 987.5519 990.5744 991.4203 999.7528 1024.6691 1031.2268 1050.1105 1084.9038 1088.7385 1125.2080 1145.9002 1152.6132 1169.7168 1175.9529 1183.8210 1232.0901 1238.0900 1243.1011 1261.8167 1279.9474 1293.8632 1332.4628 1342.6172 1382.7070 1386.3230 1398.9837 1410.5964 1421.2022 1434.1651 1447.8778 1457.1888 1481.0105 1488.7750 1517.6609 1580.4275 1589.7305 1600.5841 1609.8482 1632.6885 1633.9311 2855.6953 3119.6159 3121.3931 3123.9373 3129.4915 3139.4151 3139.6395 3150.2022 3159.4263 3161.1571 3169.8808 3184.8214 3543.1536 3569.8634
redmass: 5.5244 5.5895 4.7240 5.4367 4.1602 4.9177 5.4986 4.9232 5.6188 4.7610 4.4407 5.7733 3.5960 2.3128 2.5681 2.1452 3.1248 3.6978 4.4869 6.5780 3.2908 5.7138 4.3364 2.7165 2.0870 3.5734 6.3084 3.4849 3.7770 5.5852 4.8589 1.3195 1.8471 5.3487 2.4940 2.4174 3.4969 1.5748 3.0735 1.7498 1.9372 3.9697 1.4325 1.3647 1.3716 1.3593 1.3970 3.7890 1.3496 2.9871 2.1596 2.8953 3.0193 2.4343 3.1769 2.3275 1.4169 1.0782 1.1378 1.2318 1.5647 1.9775 1.9024 1.5425 1.6835 1.5841 1.7425 1.8578 2.8620 1.9172 2.3919 4.0652 3.5449 2.1317 2.0233 2.5344 2.2910 3.2989 3.8474 5.9801 7.3602 5.2651 6.2078 7.2139 6.5262 1.0826 1.0870 1.0876 1.0870 1.0905 1.0898 1.0906 1.0930 1.0975 1.0984 1.0999 1.0955 1.0773 1.0777
irintensity: 0.2933 1.2868 0.5073 0.4054 2.0380 3.8835 1.8098 1.0355 2.2148 1.3514 1.1966 13.7601 3.5805 11.0925 36.1416 39.8635 7.3296 6.1961 35.2656 8.2868 8.9024 4.6896 4.4676 54.9420 28.4494 7.7792 8.1601 1.1699 37.5557 7.1492 6.7065 1.3272 92.3068 3.8449 13.7595 48.4326 20.2059 62.5562 3.9333 2.0614 7.5167 17.5846 0.7395 2.9124 0.4456 2.2720 2.2110 19.3527 0.5279 5.0732 9.4279 4.8362 3.8248 9.0019 39.9542 29.4757 3.4254 7.7605 5.4680 0.1284 0.3624 2.6885 15.0436 1.8117 0.1371 32.3286 5.8248 169.1953 31.4859 9.4945 67.2985 18.8658 3.4124 25.4489 31.1478 1.7432 4.3547 323.1619 16.3752 17.5577 1.7678 3.9081 237.8922 335.8461 5.1952 80.7899 8.2794 5.3955 1.1117 12.8841 12.9473 16.5837 9.8959 34.2945 25.4173 26.8398 7.4967 31.9229 28.6083
temp: 298.150 k
press: 1.00000 atm
elementType: 8 7 7 6 6 6 6 6 6 6 6 6 6 6 6 6 6 6 6 6 6 1 1 1 1 1 1 1 1 1 1 1 1 1 1
symmnumber: 1
zpe: 721130.7 jmol-1
zpe.correction: 0.274664 hartree
zpe.thermalcorrener: 0.290524 hartree
zpe.thermalcorrenthalpy: 0.291468 hartree
zpe.thermalcorrgfe: 0.230985 hartree
zpe.sumelectzpe: -877.646084 hartree
zpe.sumelectthermal: -877.630224 hartree
zpe.sumelectthermalent: -877.629280 hartree
zpe.sumelectthermalfe: -877.689763 hartree
dipole: -3.6977 -1.0557 -4.3348
dipole: 5.7947
quadrupole: -109.8470 -112.5913 -130.2412
quadrupole: 1.6003 -10.5063 -0.1131
quadrupole: 7.7128 4.9685 -12.6813 1.6003 -10.5063 -0.1131
hfenergy: -877.9207479 hartree
pointgroup: C01 [X(C18H14N2O1)]
dipole: 1.4685583 0.2415245 -1.7269871 debye
polarizability: 294.678679|9.4793045|196.16789|-3.9260276|-6.5884161|155.7945475 unknown
InChI: InChI=1S/C18H14N2O/c21-18-15-9-3-4-11-16(15)19-17(20-18)14-10-5-7-12-6-1-2-8-13(12)14/h1-11,17,19-20H
charge 0 multiplicity 1
35 atoms
O  -2.411412 0.325649 2.843331
N  -0.895554 0.273741 -0.986898
N  -0.655306 0.667644 1.354559
C  -0.194618 1.099203 0.014392
C  1.322944 1.022868 -0.132166
C  2.057906 -0.2184 -0.005468
C  -2.271688 0.067927 -0.851168
C  -2.862493 0.191983 0.447437
C  3.501751 -0.184495 -0.16171
C  -2.000097 0.416955 1.645072
C  2.00929 2.214576 -0.396321
C  1.432455 -1.482963 0.270366
C  4.15998 1.060487 -0.433459
C  -3.090103 -0.296258 -1.955846
C  3.428775 2.241819 -0.549037
C  -4.252277 -0.016263 0.610935
C  4.25341 -1.400259 -0.039679
C  2.193851 -2.64861 0.384266
C  -4.470832 -0.501062 -1.769485
C  -5.064864 -0.352955 -0.488696
C  3.615161 -2.611732 0.228111
H  -0.487209 2.169023 -0.127897
H  -0.463554 0.197263 -1.90754
H  -0.028669 0.808177 2.150588
H  1.442327 3.14932 -0.486835
H  0.347905 -1.520673 0.392137
H  5.250591 1.067567 -0.54726
H  -2.644334 -0.405353 -2.952001
H  3.933599 3.191218 -0.754722
H  -4.660539 0.071162 1.623549
H  5.342687 -1.35926 -0.159371
H  1.698911 -3.602193 0.597983
H  -5.092457 -0.772663 -2.63051
H  -6.139796 -0.511169 -0.357655
H  4.196759 -3.535276 0.321494
