program: Gaussian 09
title: 000286684
version: EM64L-G09RevD.01
frameworkgroup: C1[X(C11H15N5O4)]
method: RPBEPBE
basis: SDD
operation: Freq
keyword: #p
keyword: freq=noraman
keyword: PBEPBE/SDD
title: #p freq=noraman PBEPBE/SDD
converged: NO YES NO NO
title: Mulliken charges:
elementType: O O O O N N N N N C C C C C C C C C C C H H H H H H H H H H H H H H H
charge: -0.297084 -0.447574 -0.443354 -0.446549 -0.060482 -0.170524 -0.036265 -0.054703 -0.634466 -0.243304 -0.145856 -0.160231 -0.094616 0.131383 -0.332660 -0.080702 0.188433 0.138047 -0.638122 -0.395147 0.293655 0.244061 0.245223 0.246099 0.236613 0.223989 0.351960 0.355577 0.350241 0.232538 0.237500 0.278403 0.250520 0.333081 0.344317
chargesum: 0.00000
title: Mulliken charges with hydrogens summed into heavy atoms:
elementType: O O O O N N N N N C C C C C C C C C C C
charge: -0.297084 -0.095614 -0.087777 -0.096309 -0.060482 -0.170524 -0.036265 -0.054703 0.042932 0.050351 0.098205 0.084992 0.151482 0.131383 0.127941 -0.080702 0.188433 0.138047 0.110319 -0.144627
polarizability: 2.24080239e+02 -1.99485460e+00 1.63552464e+02 5.78954782e+00 -1.63420328e+01 1.19000926e+02
1716.lowfreq: 0.0005 0.0006 0.0009 3.7301 6.0994 7.9492 27.3184 37.5350 59.0633
frequency: 27.1981 37.5342 59.0508 79.0617 96.3124 106.5580 117.4369 120.1883 171.6990 178.5325 203.2766 213.6320 229.8638 239.7168 278.7699 299.5308 306.9158 339.7936 372.6288 379.8189 380.9541 388.9476 419.7965 472.2262 481.7102 500.2792 508.2739 540.2507 553.3042 571.0747 580.3504 610.6737 620.3864 644.2053 693.0533 700.1573 737.0631 779.8720 800.0257 809.0737 893.4892 920.7525 937.2727 947.5580 954.6837 969.8715 989.2416 998.4870 1018.3748 1050.7338 1057.3742 1073.8221 1089.8811 1119.8887 1122.1656 1168.8758 1181.8408 1207.4795 1221.1896 1229.0044 1241.3203 1254.9004 1271.7835 1278.1083 1301.6639 1308.8386 1315.1568 1335.2809 1343.8620 1352.3611 1376.5535 1384.9262 1387.3461 1390.1255 1406.8922 1432.1780 1445.2975 1463.9341 1478.2118 1481.0523 1485.9251 1525.4297 1582.9716 1624.4473 2975.1213 2980.6878 2989.9247 3010.0436 3030.3354 3056.4738 3063.3858 3104.6635 3129.3552 3167.9630 3524.9942 3543.6820 3564.1791 3578.6249 3702.6914
redmass: 5.5023 6.5090 5.6770 4.8028 4.0030 5.8054 1.9181 1.4691 4.7663 5.6117 4.9041 4.5202 3.8473 3.6837 5.9462 3.8151 1.1659 3.4658 1.9407 2.2493 4.0079 1.1356 3.6065 1.3526 3.9807 4.4331 4.2624 1.2790 6.2437 5.8731 4.6575 4.8177 5.1072 5.5739 4.0947 9.2632 6.3026 4.7678 6.8420 7.7416 4.0064 3.9907 1.4234 4.7891 2.7635 2.7254 2.9168 4.7028 3.9131 2.5086 3.0620 3.3916 2.1520 1.3126 2.4832 1.1558 1.2755 4.2202 1.4109 1.2591 3.2371 2.4473 1.4682 1.3717 1.3953 2.9813 1.3574 2.4717 1.2790 1.9992 3.6698 1.5202 1.4402 2.0430 1.4143 1.8554 1.8751 1.0898 1.0556 1.2101 4.0544 6.9393 2.7933 1.8041 1.0840 1.0363 1.0676 1.0850 1.0867 1.0872 1.1029 1.0980 1.0968 1.0921 1.0652 1.0460 1.0659 1.0665 1.1034
irintensity: 1.6326 0.6457 1.9427 1.2145 0.3045 3.1629 4.4910 5.1520 2.5179 1.3647 4.0624 5.1842 1.7425 1.2694 4.6099 2.7931 130.3361 17.5686 83.7138 80.4514 3.8105 136.8204 8.2055 122.4250 4.6031 10.1773 10.4936 118.9494 18.8020 3.5039 18.0481 5.4447 13.8960 1.9164 15.6466 19.7461 25.0703 15.9369 14.0537 49.0997 40.4864 86.5702 10.3321 4.0271 5.6257 107.1298 27.1890 27.5113 92.9811 15.7149 128.5762 2.7318 16.5570 0.5396 12.0258 20.7473 30.2218 6.7671 3.2900 5.8027 20.4534 12.1653 18.1463 10.4981 9.7257 23.4697 35.0215 12.9729 37.3836 22.3048 25.6595 12.5158 11.6183 26.1771 2.4961 39.2075 2.5985 13.7896 18.5387 36.0198 0.5046 106.3562 54.3313 499.6609 30.1657 52.3537 20.1155 13.7037 17.0001 36.1096 22.2007 25.0076 1.0343 13.2291 4.7552 108.0616 12.3678 7.8419 38.5215
temp: 298.150 k
press: 1.00000 atm
elementType: 8 8 8 8 7 7 7 7 7 6 6 6 6 6 6 6 6 6 6 6 1 1 1 1 1 1 1 1 1 1 1 1 1 1 1
symmnumber: 1
zpe: 709935.1 jmol-1
zpe.correction: 0.270400 hartree
zpe.thermalcorrener: 0.289497 hartree
zpe.thermalcorrenthalpy: 0.290441 hartree
zpe.thermalcorrgfe: 0.222801 hartree
zpe.sumelectzpe: -1001.273893 hartree
zpe.sumelectthermal: -1001.254796 hartree
zpe.sumelectthermalent: -1001.253852 hartree
zpe.sumelectthermalfe: -1001.321492 hartree
dipole: 8.1296 -4.1024 -2.1393
dipole: 9.3540
quadrupole: -88.3091 -126.3905 -119.2824
quadrupole: -0.9332 11.4297 -3.3234
quadrupole: 23.0182 -15.0631 -7.9551 -0.9332 11.4297 -3.3234
hfenergy: -1001.5442931 hartree
pointgroup: C01 [X(C11H15N5O4)]
dipole: 3.2405359 1.7001748 0.3895765 debye
polarizability: 222.1315011|-0.1456807|160.1119663|-15.0732528|-20.3235928|124.3901613 unknown
InChI: InChI=1S/C11H15N5O4/c1-16-7-5(13-3-14-11(7)12)6(15-16)10-9(19)8(18)4(2-17)20-10/h3-4,8-10,17-19H,2,12H2,1H3
charge 0 multiplicity 1
35 atoms
O  -1.995328 0.403028 -1.212846
O  -2.055971 2.14144 2.034058
O  -4.137563 -0.158339 1.7202
O  -2.590999 -2.335294 -1.617172
N  1.023468 1.877391 -0.89719
N  2.306242 1.331405 -0.811363
N  0.516002 -1.229527 0.957284
N  2.858105 -1.952395 0.949633
N  4.61485 -0.769771 -0.044016
C  -1.970466 0.979175 1.14492
C  -1.284331 1.278141 -0.214216
C  -3.404475 0.613356 0.723356
C  -3.203635 -0.215491 -0.555911
C  0.185428 1.005107 -0.264879
C  -2.921821 -1.709257 -0.330651
C  0.928148 -0.121682 0.242647
C  2.290186 0.117528 -0.130148
C  3.270932 -0.856144 0.247596
C  3.420349 2.057913 -1.419885
C  1.525881 -2.07898 1.265497
H  -1.493002 0.117918 1.649726
H  -1.468363 2.33367 -0.492953
H  -3.933548 1.561553 0.489765
H  -4.028154 -0.100643 -1.280147
H  -3.825304 -2.218573 0.038043
H  -2.097149 -1.845686 0.397073
H  -1.183242 2.285025 2.477603
H  -4.222837 0.401377 2.533351
H  -1.866954 -1.785049 -2.017499
H  4.188974 2.317318 -0.668977
H  3.877063 1.477854 -2.242835
H  3.008048 2.988354 -1.836635
H  1.261357 -2.977346 1.830805
H  5.016748 -0.008248 -0.581888
H  5.208061 -1.53423 0.275952
