program: Gaussian 09
title: 000286715
version: EM64L-G09RevD.01
frameworkgroup: C1[X(C20H23BrCl2N2O)]
method: RPBEPBE
basis: SDD
operation: Freq
keyword: #p
keyword: freq=noraman
keyword: PBEPBE/SDD
title: #p freq=noraman PBEPBE/SDD
converged: YES YES NO NO
title: Mulliken charges:
elementType: Br Cl Cl O N N C C C C C C C C C C C C C C C C C C C C H H H H H H H H H H H H H H H H H H H H H H H
charge: 0.004495 -0.061890 -0.061406 -0.243374 -0.172148 -0.456437 -0.554925 -0.362330 0.521708 0.440092 -0.571118 -0.390512 -0.389387 -0.437990 -0.446140 -0.370413 -0.368504 -0.584062 -0.585009 0.204520 0.490612 -0.439732 -0.335350 -0.152909 -0.165127 -0.236582 0.196880 0.198639 0.235645 0.236324 0.236810 0.235161 0.248004 0.246755 0.249554 0.247184 0.229850 0.230061 0.229357 0.229343 0.294165 0.267979 0.292280 0.267524 0.310783 0.226601 0.315026 0.250017 0.249978
chargesum: 0.00000
title: Mulliken charges with hydrogens summed into heavy atoms:
elementType: Br Cl Cl O N N C C C C C C C C C C C C C C C C C C C C
charge: 0.004495 -0.061890 -0.061406 -0.243374 -0.172148 -0.145654 -0.159407 0.109639 0.521708 0.440092 -0.099146 0.104247 0.107351 -0.208140 -0.216079 -0.141056 -0.139161 -0.021918 -0.025205 0.204520 0.490612 -0.213132 -0.020324 0.097108 0.084851 -0.236582
polarizability: 4.33168347e+02 7.61840068e+00 2.23171572e+02 -1.50356208e+01 -5.16149400e+00 2.11841648e+02
1716.lowfreq: -18.8087 -3.9744 -2.0480 -0.0005 0.0008 0.0023 0.0951 4.7437 12.2576
frequency: -18.7996 2.6566 12.2363 25.1219 27.7456 39.1782 45.2018 55.5113 60.0735 67.4899 69.8593 84.3899 99.8850 123.5507 136.2798 142.3928 143.4976 205.7001 206.0677 215.5912 234.1192 244.7010 265.1098 270.9782 319.7189 327.8027 355.9905 365.1384 374.4974 387.0746 409.8088 414.2235 439.9601 504.6100 515.3947 531.0228 555.2926 564.7538 610.4141 626.0673 637.9582 638.2319 659.9861 692.1229 695.5361 707.4905 724.7372 738.1554 743.7630 781.1033 788.4854 809.1648 813.4465 815.4939 816.9380 834.6758 848.5589 850.9101 931.4967 936.8407 941.9304 951.4383 957.2905 987.4630 989.0011 996.1031 1000.1021 1027.7496 1033.3412 1034.1857 1040.6394 1041.2179 1061.1928 1072.6917 1115.1607 1116.6591 1120.3979 1147.5179 1158.3973 1178.4796 1187.2003 1204.6688 1222.9037 1232.4196 1248.4570 1254.7634 1255.7925 1257.7934 1261.5730 1275.3254 1284.9476 1292.3324 1293.9218 1322.0543 1328.3342 1348.6753 1350.8063 1353.8436 1362.0709 1375.2332 1385.2820 1396.4320 1427.4028 1440.7588 1457.4997 1458.7222 1465.6100 1474.0736 1482.1483 1482.5948 1496.5527 1503.5590 1517.3193 1572.0212 1589.2673 1602.6417 1630.3258 1632.1788 2955.0112 2966.1930 3004.0373 3011.6863 3012.3255 3016.8391 3017.0255 3062.8323 3063.0293 3068.1116 3073.1549 3075.3757 3114.8154 3117.5012 3119.2272 3147.6292 3148.2663 3155.0612 3161.0943 3165.7698 3172.2992 3196.5989 3519.3437
redmass: 5.0494 9.4441 10.0916 10.0681 12.3630 7.6887 4.8216 3.5667 4.4132 2.3598 6.4591 3.4995 2.9338 4.5244 3.1057 5.6770 4.8989 6.2828 5.9240 6.4684 4.7590 2.9304 5.4067 7.1532 5.0936 3.9343 4.4801 3.7505 4.2529 4.2049 2.9863 3.1656 3.7495 2.7074 2.8974 4.6928 2.9856 2.6686 6.2091 6.8754 4.1624 1.3368 6.7817 5.2446 4.7903 3.4038 3.9524 3.7357 1.1878 1.1245 1.1998 2.4813 1.2770 1.4109 3.4013 3.2354 1.4139 1.4679 4.8031 1.4700 1.3621 1.8208 1.8618 1.3318 4.8439 1.4189 2.9785 4.0323 3.6823 2.2021 1.8648 2.1468 2.6428 2.9446 1.4199 1.3534 1.3350 1.2426 2.3155 1.6990 1.1100 1.1726 2.1816 1.9239 1.6123 1.1637 1.1618 1.2940 1.9684 1.3477 1.0831 1.1979 1.3543 1.5594 1.3176 1.7862 1.2785 1.4231 3.5447 5.2097 1.7994 4.4445 3.1262 1.1025 1.0960 1.0954 1.0875 2.3100 1.0998 1.0884 2.2415 1.1122 2.6406 6.5239 6.0808 6.0594 4.8504 6.3859 1.0589 1.0590 1.0990 1.0599 1.0604 1.0607 1.1015 1.0581 1.0610 1.0992 1.1029 1.1041 1.0891 1.0889 1.0902 1.1115 1.1116 1.0932 1.0933 1.0911 1.0950 1.0954 1.0761
irintensity: 2.6301 0.3735 0.1148 0.0923 1.0083 0.2698 0.3517 0.5545 0.7015 0.7758 1.7115 7.1328 0.9826 0.6718 0.7262 1.7367 0.1160 4.7254 1.4423 0.0415 7.1481 9.1017 15.0296 1.1760 0.1666 6.2724 0.8158 4.7418 6.3873 22.4794 0.0113 1.0054 0.8523 36.4583 13.2287 19.8945 12.2939 2.5619 11.2414 3.3898 16.0586 39.2305 54.2408 80.1293 24.4926 0.6492 13.2124 18.6241 6.2221 3.5180 11.0102 38.4771 2.1615 41.6719 10.0340 18.5315 26.7956 30.3376 21.3257 1.9728 1.2793 10.6688 10.8711 3.5343 41.1061 3.2852 0.2038 34.6038 0.6710 0.6546 1.4533 1.9038 32.7651 1.1728 4.8756 16.8625 34.0661 5.7801 79.4826 71.1577 5.5599 7.3746 39.0079 1.3918 19.0821 19.7810 13.3268 1.9820 62.0187 45.7785 0.3447 9.6835 30.8781 3.0652 4.8953 36.4917 7.5491 60.2155 172.5463 2.7726 53.8808 22.7091 3.6048 11.7280 14.7951 9.7483 4.5167 111.6428 11.4844 26.6066 655.6476 0.0410 249.5446 4.3016 49.8527 17.8356 73.4640 134.6712 19.6372 52.5279 14.1675 25.0100 19.0934 16.0770 10.3859 4.4809 22.1969 14.2434 10.9071 31.1704 11.6603 34.6838 16.1075 2.3152 20.6879 30.2372 13.3210 3.7676 3.8276 10.5003 12.4568
temp: 298.150 k
press: 1.00000 atm
elementType: 35 17 17 8 7 7 6 6 6 6 6 6 6 6 6 6 6 6 6 6 6 6 6 6 6 6 1 1 1 1 1 1 1 1 1 1 1 1 1 1 1 1 1 1 1 1 1 1 1
symmnumber: 1
zpe: 1020330.2 jmol-1
zpe.correction: 0.388623 hartree
zpe.thermalcorrener: 0.414832 hartree
zpe.thermalcorrenthalpy: 0.415776 hartree
zpe.thermalcorrgfe: 0.323855 hartree
zpe.sumelectzpe: -1892.331736 hartree
zpe.sumelectthermal: -1892.305528 hartree
zpe.sumelectthermalent: -1892.304583 hartree
zpe.sumelectthermalfe: -1892.396504 hartree
dipole: 0.4124 -2.3633 4.3041
dipole: 4.9275
quadrupole: -212.0329 -190.6836 -170.2790
quadrupole: 9.1791 -12.5945 -8.3826
quadrupole: -21.0344 0.3149 20.7195 9.1791 -12.5945 -8.3826
hfenergy: -1892.7203595 hartree
pointgroup: C01 [X(C20H23Br1Cl2N2O1)]
dipole: 0.1082242 1.0224264 -1.6435433 debye
polarizability: 433.9372997|-4.8474762|223.4643925|9.774424|-4.1598104|210.7798757 unknown
InChI: InChI=1S/C20H23BrCl2N2O/c21-17-6-8-18(9-7-17)24-20(26)3-1-2-16-4-10-19(11-5-16)25(14-12-22)15-13-23/h4-11,24H,1-3,12-15H2
charge 0 multiplicity 1
49 atoms
Br -10.07188 -0.878993 1.578579
Cl 7.007757 -4.157145 0.021095
Cl 7.870402 2.883274 2.070908
O  -2.977446 -0.47237 0.678392
N  5.724093 -0.220829 0.339036
N  -4.510416 0.500936 -0.809049
C  0.403105 0.996281 -1.709501
C  -0.697824 0.424956 -0.774986
C  1.807138 0.696807 -1.206846
C  4.436175 0.080547 -0.170254
C  -2.113705 0.753552 -1.284014
C  6.471841 -1.401966 -0.120595
C  6.357866 0.623241 1.364098
C  2.455019 1.547529 -0.27743
C  2.50766 -0.466706 -1.608893
C  3.736635 1.259258 0.230643
C  3.787103 -0.778649 -1.10779
C  6.0487 -2.658587 0.664958
C  7.095073 1.812326 0.717708
C  -3.216602 0.195884 -0.368785
C  -5.758374 0.156012 -0.219767
C  -6.939333 0.600278 -0.874175
C  -5.86768 -0.602288 0.977233
C  -8.21233 0.298527 -0.350891
C  -7.143066 -0.904235 1.501506
C  -8.301633 -0.454326 0.838107
H  0.261975 2.092522 -1.800308
H  0.268026 0.573017 -2.725303
H  -0.568713 0.829053 0.24563
H  -0.580941 -0.670223 -0.683724
H  -2.251741 0.343925 -2.306888
H  -2.236761 1.853875 -1.369412
H  6.324629 -1.566178 -1.202752
H  7.552915 -1.230784 0.027943
H  5.611843 0.991072 2.090841
H  7.084212 0.019457 1.936778
H  1.951803 2.464672 0.054552
H  2.043481 -1.152324 -2.329303
H  4.187082 1.96562 0.934235
H  4.270016 -1.697613 -1.453412
H  4.984737 -2.899444 0.530109
H  6.293992 -2.583263 1.73482
H  6.41785 2.474434 0.159739
H  7.928707 1.486527 0.07785
H  -4.569755 1.048933 -1.671272
H  -6.869576 1.186786 -1.799157
H  -4.962319 -0.944099 1.481188
H  -9.114552 0.645234 -0.862145
H  -7.223691 -1.487712 2.423102
