program: Gaussian 09
title: 000286683
version: EM64L-G09RevD.01
frameworkgroup: C1[X(C12H11Cl3N2O4)]
method: RPBEPBE
basis: SDD
operation: Freq
keyword: #p
keyword: freq=noraman
keyword: PBEPBE/SDD
title: #p freq=noraman PBEPBE/SDD
converged: YES YES NO NO
title: Mulliken charges:
elementType: Cl Cl Cl O O O O N N C C C C C C C C C C C C H H H H H H H H H H H
charge: 0.037321 -0.001069 -0.002400 -0.250800 -0.465797 -0.424291 -0.454762 -0.163375 0.025340 -0.111807 -0.158417 -0.169945 -0.145081 -0.331324 0.343447 -0.162704 0.018674 -0.314051 -0.294092 -0.085955 -0.081633 0.277643 0.291123 0.285825 0.256017 0.217263 0.223054 0.368960 0.336384 0.282925 0.286024 0.367503
chargesum: 0.00000
title: Mulliken charges with hydrogens summed into heavy atoms:
elementType: Cl Cl Cl O O O O N N C C C C C C C C C C C C
charge: 0.037321 -0.001069 -0.002400 -0.250800 -0.096838 -0.087907 -0.087259 -0.163375 0.025340 0.165835 0.132706 0.115880 0.110935 0.108994 0.343447 -0.162704 0.018674 -0.031126 -0.008068 -0.085955 -0.081633
polarizability: 2.76950887e+02 2.06571599e+01 1.87274616e+02 -5.10015918e+00 -4.71911534e-01 9.82304838e+01
1716.lowfreq: -11.6027 -4.6191 -0.0024 -0.0020 -0.0014 3.8854 19.2598 37.2320 47.4048
frequency: 18.4858 37.1643 47.3667 77.8136 91.3551 116.7145 126.3161 133.3017 158.8876 182.8019 185.1473 196.0905 207.0183 237.8780 263.9621 269.6962 292.5772 300.4694 323.7661 331.1873 353.1890 377.4866 402.9919 413.0576 422.4372 429.3676 475.0428 495.9941 530.7070 564.7272 609.4140 626.7416 637.5700 646.1036 690.6272 713.9404 733.8409 742.9958 782.4909 793.4396 851.2897 858.4061 871.5444 882.0885 922.2077 932.8435 941.8118 990.6254 1000.7353 1016.3936 1032.5376 1052.8409 1073.3486 1084.2766 1091.2560 1164.0421 1182.2766 1186.1757 1207.6056 1212.7817 1216.4722 1246.9323 1256.0447 1264.4522 1288.5525 1300.6012 1311.6579 1351.5560 1362.1488 1364.1261 1368.9212 1392.1907 1394.4261 1409.5165 1426.6626 1449.6452 1455.5243 1574.5994 1617.8587 2982.3097 3031.2260 3032.6765 3044.9183 3067.2878 3073.6007 3170.1207 3188.6924 3461.1180 3490.9738 3577.8245
redmass: 6.4648 9.1970 8.9177 13.3484 5.3615 6.5048 7.6379 7.2185 7.2872 8.5793 15.4651 5.3271 6.0089 5.5895 2.7665 2.5134 3.5541 16.0260 5.9168 5.2175 8.2994 5.4714 6.8707 1.2859 3.3522 3.5315 3.5087 12.1068 1.2706 5.8223 4.2325 10.6382 8.1437 7.8644 6.9845 8.6901 5.7921 4.1974 5.4812 4.2636 1.4755 5.0072 3.6335 1.4680 8.7166 3.2746 3.4014 2.7779 6.2525 2.7433 4.3846 4.8521 2.8279 1.7880 2.6014 1.4033 3.9067 1.1734 1.1697 1.5105 1.5765 2.2485 1.5049 1.2612 2.6083 1.7447 1.4952 1.2713 2.0527 2.4920 1.3694 1.2945 2.0776 2.7037 3.5481 5.8152 1.0780 10.2354 8.6306 1.0646 1.0857 1.0867 1.0883 1.0979 1.0878 1.0936 1.0936 1.0666 1.0663 1.0663
irintensity: 0.6722 0.1784 0.3581 0.2742 7.3721 5.2492 1.2006 1.7384 3.2335 6.4227 0.4915 3.6280 15.1211 46.7604 163.2811 72.2269 21.9572 2.8575 18.2696 4.4649 1.1131 0.8789 3.5611 73.8323 40.6347 7.3501 39.4224 21.3506 98.7708 23.1361 11.2691 0.5250 0.5570 14.8946 8.2485 0.5658 45.6941 2.8696 26.8337 37.9974 19.1809 2.3256 15.9140 29.9314 49.8335 21.9842 32.7793 30.7036 51.7570 42.9129 160.1123 42.7528 17.4381 8.2704 105.4235 24.0657 125.4937 17.8861 47.8492 7.7367 17.7279 16.4595 12.8404 9.2673 26.6118 2.4051 23.6107 14.4336 6.0633 36.3856 48.0940 24.3298 29.5496 227.2793 206.8939 3.0495 7.3465 8.3070 6.0277 46.1427 12.7894 14.5561 16.7504 26.3863 10.6598 0.0885 0.6619 60.3049 93.1988 22.8417
temp: 298.150 k
press: 1.00000 atm
elementType: 17 17 17 8 8 8 8 7 7 6 6 6 6 6 6 6 6 6 6 6 6 1 1 1 1 1 1 1 1 1 1 1
symmnumber: 1
zpe: 578800.5 jmol-1
zpe.correction: 0.220453 hartree
zpe.thermalcorrener: 0.240230 hartree
zpe.thermalcorrenthalpy: 0.241174 hartree
zpe.thermalcorrgfe: 0.170820 hartree
zpe.sumelectzpe: -2252.855509 hartree
zpe.sumelectthermal: -2252.835732 hartree
zpe.sumelectthermalent: -2252.834788 hartree
zpe.sumelectthermalfe: -2252.905143 hartree
dipole: 2.4033 -0.9736 0.8900
dipole: 2.7414
quadrupole: -155.0423 -149.1446 -146.3220
quadrupole: 2.9448 0.1329 -5.4763
quadrupole: -4.8727 1.0250 3.8476 2.9448 0.1329 -5.4763
hfenergy: -2253.0759626 hartree
pointgroup: C01 [X(C12H11Cl3N2O4)]
dipole: 0.9959971 -0.2389169 0.3379509 debye
polarizability: 271.5486355|20.5284007|183.1916176|-25.9721996|-24.8622035|107.7157333 unknown
InChI: InChI=1S/C12H11Cl3N2O4/c13-4-1-6-7(2-5(4)14)17(12(15)16-6)11-10(20)9(19)8(3-18)21-11/h1-2,8-11,18-20H,3H2
charge 0 multiplicity 1
32 atoms
Cl 1.472898 2.864069 -1.125164
Cl -4.082832 -2.551448 0.929417
Cl -5.835101 0.176157 0.559405
O  2.163778 -0.190354 -1.39542
O  2.015466 -2.107736 1.071024
O  3.196177 1.429367 1.383043
O  4.410192 -2.255354 -0.468719
N  0.052692 0.541683 -0.410643
N  -1.190217 2.467703 -0.654937
C  1.141487 -0.473912 -0.41194
C  1.860276 -0.645772 0.951626
C  3.225187 0.094939 0.791476
C  3.495138 0.075714 -0.737458
C  4.495902 -0.995748 -1.204206
C  -1.288694 0.196219 -0.127487
C  0.014446 1.915038 -0.709936
C  -2.043962 1.403571 -0.287483
C  -1.88599 -1.021811 0.248873
C  -3.438195 1.404971 -0.07845
C  -3.280222 -1.001448 0.448868
C  -4.044282 0.190291 0.288098
H  0.654675 -1.427846 -0.683803
H  1.292758 -0.233014 1.804907
H  4.019221 -0.43771 1.339401
H  3.824289 1.067989 -1.097497
H  5.524035 -0.63015 -1.034594
H  4.348554 -1.152278 -2.292359
H  2.536149 -2.325927 1.884679
H  2.701416 2.059658 0.79414
H  -1.327212 -1.949609 0.397001
H  -4.026493 2.317596 -0.197361
H  3.455858 -2.521247 -0.360603
