program: Gaussian 09
title: 000286647
version: EM64L-G09RevD.01
frameworkgroup: C1[X(C10H15NO)]
method: RPBEPBE
basis: SDD
operation: Freq
keyword: #p
keyword: freq=noraman
keyword: PBEPBE/SDD
title: #p freq=noraman PBEPBE/SDD
converged: NO YES NO NO
title: Mulliken charges:
elementType: O N C C C C C C C C C C H H H H H H H H H H H H H H H
charge: -0.275238 -0.312627 -0.072360 -0.072384 -0.461817 -0.153092 -0.158566 -0.419150 -0.419085 -0.469047 -0.468989 0.084002 0.201642 0.201646 0.196471 0.196861 0.205776 0.233740 0.194002 0.212192 0.212188 0.193986 0.206946 0.214813 0.214832 0.206957 0.306303
chargesum: 0.00000
title: Mulliken charges with hydrogens summed into heavy atoms:
elementType: O N C C C C C C C C C C
charge: -0.275238 -0.006324 0.129282 0.129262 -0.068484 0.052685 0.075174 -0.012957 -0.012912 -0.047288 -0.047201 0.084002
polarizability: 1.14690581e+02 3.64441367e+00 1.04576343e+02 -2.20691749e-03 -5.21182027e-04 9.39742052e+01
1716.lowfreq: -0.0005 0.0001 0.0008 11.2113 21.7397 25.8833 91.2316 210.7901 235.8079
frequency: 91.0873 210.7199 235.7930 320.2255 321.1134 358.9176 363.3998 389.3763 437.2280 440.1784 521.8597 560.5956 576.3709 634.8962 659.2863 732.0474 756.2338 766.0400 799.0479 804.5898 853.3839 875.2944 911.7473 925.9524 931.0607 950.4166 977.1312 985.2565 1064.9281 1065.1496 1078.7540 1093.3061 1095.0393 1120.0663 1123.0918 1137.6427 1181.5415 1208.8443 1231.3703 1259.1519 1281.7852 1290.4679 1297.5267 1311.2395 1329.3408 1332.5353 1340.1213 1346.8118 1360.1104 1360.3916 1362.3969 1362.9853 1394.1694 1429.3222 1443.5530 1452.3101 1463.3318 1463.4920 1483.5702 1612.0456 2965.1191 2967.4852 2969.8387 2971.6277 2972.2159 2993.0266 2998.8928 3014.4608 3024.0486 3029.9178 3033.8223 3036.7090 3039.9741 3041.5762 3514.7699
redmass: 6.4964 2.8153 2.2746 2.0860 6.0828 2.9061 3.6249 1.8492 2.7044 3.3265 2.5560 4.0752 1.2529 3.7856 4.4464 4.5912 3.8771 2.6299 3.0274 2.7826 1.6936 2.3089 2.0356 2.1021 2.1055 2.2336 2.8407 3.3847 1.9705 1.9548 1.6815 1.5236 1.6750 1.0489 1.7491 1.0594 1.2086 1.1833 1.1834 1.5467 1.6225 2.1792 1.9079 1.8599 1.5758 1.3319 1.3482 1.4959 1.4557 1.4385 1.5550 1.5346 1.4762 1.8768 1.0821 1.1558 1.0847 1.1056 1.1004 5.0025 1.0659 1.0656 1.0626 1.0612 1.0621 1.0806 1.0817 1.0847 1.1023 1.1015 1.1001 1.1004 1.0944 1.0938 1.0763
irintensity: 1.5958 0.0003 0.1822 0.7447 0.6961 0.2738 7.1685 0.2079 5.4300 0.8292 3.3244 0.1742 67.1122 14.0722 0.2914 22.8781 2.6408 1.0603 3.3883 6.0744 0.1253 0.5098 3.3583 1.1016 5.4425 13.0590 5.9100 1.0670 0.0216 3.4090 7.2180 0.5630 17.5229 2.7667 11.6889 0.0159 1.7325 33.5231 1.8049 1.1715 0.0464 24.6098 0.0703 2.4608 2.6970 0.0314 0.2284 14.9812 0.0694 0.8638 1.6427 11.3197 15.1102 51.4359 5.2876 5.0825 15.9266 21.0116 13.2564 313.0800 13.6922 8.4714 11.2759 0.5801 69.0464 142.2076 102.4516 68.1027 20.4806 6.0881 35.7435 44.3183 58.6662 30.4248 14.0410
temp: 298.150 k
press: 1.00000 atm
elementType: 8 7 6 6 6 6 6 6 6 6 6 6 1 1 1 1 1 1 1 1 1 1 1 1 1 1 1
symmnumber: 1
zpe: 624086.6 jmol-1
zpe.correction: 0.237702 hartree
zpe.thermalcorrener: 0.246792 hartree
zpe.thermalcorrenthalpy: 0.247736 hartree
zpe.thermalcorrgfe: 0.204126 hartree
zpe.sumelectzpe: -519.138482 hartree
zpe.sumelectthermal: -519.129392 hartree
zpe.sumelectthermalent: -519.128447 hartree
zpe.sumelectthermalfe: -519.172058 hartree
dipole: 4.5230 1.4044 -0.0007
dipole: 4.7360
quadrupole: -87.9543 -65.4163 -71.0079
quadrupole: -2.9783 0.0028 -0.0011
quadrupole: -13.1615 9.3766 3.7849 -2.9783 0.0028 -0.0011
hfenergy: -519.3761839 hartree
pointgroup: C01 [X(C10H15N1O1)]
dipole: 1.7854185 0.5330587 -0.0009104 debye
polarizability: 114.7689624|3.5330991|104.4979574|-0.0096771|-0.0021267|93.9742094 unknown
InChI: InChI=1S/C10H15NO/c12-10-8-2-6-1-7(3-8)5-9(4-6)11-10/h6-9,11H,1-5H2
charge 0 multiplicity 1
27 atoms
O  -3.060269 -0.137763 0.001448
N  -1.238826 1.279748 0.000153
C  1.284857 -0.348494 -1.26352
C  1.285462 -0.347859 1.263162
C  2.129582 -0.660226 -0.000301
C  0.200995 1.644546 -0.00036
C  -0.841928 -1.191599 0.000455
C  0.936058 1.163525 -1.283203
C  0.936839 1.164191 1.282273
C  0.033987 -1.267979 -1.286943
C  0.034461 -1.26718 1.287591
C  -1.796942 0.012862 0.000088
H  1.884065 -0.570563 -2.169218
H  1.885055 -0.569557 2.168695
H  2.435949 -1.725301 -0.000109
H  3.056943 -0.052441 -0.000667
H  0.21007 2.751366 -0.000617
H  -1.528683 -2.056689 0.00086
H  1.881031 1.737703 -1.369382
H  0.318289 1.412075 -2.167179
H  0.319658 1.413294 2.166501
H  1.881928 1.738316 1.367516
H  0.382024 -2.315399 -1.39389
H  -0.590487 -1.04812 -2.174539
H  -0.589661 -1.046693 2.175281
H  0.382457 -2.314555 1.395132
H  -1.924512 2.03999 0.000374
