program: Gaussian 09
title: 000286648
version: EM64L-G09RevD.01
frameworkgroup: C1[X(C10H14N2O2)]
method: RPBEPBE
basis: SDD
operation: Freq
keyword: #p
keyword: freq=noraman
keyword: PBEPBE/SDD
title: #p freq=noraman PBEPBE/SDD
converged: NO NO NO NO
title: Mulliken charges:
elementType: O O N N C C C C C C C C C C H H H H H H H H H H H H H H
charge: -0.187830 -0.224115 -0.179199 0.121878 -0.076147 -0.076733 -0.455936 -0.139968 -0.197525 -0.435671 -0.435286 -0.470831 -0.469990 0.167433 0.211363 0.211192 0.200628 0.200306 0.256133 0.245081 0.208126 0.223574 0.223495 0.208064 0.216834 0.219342 0.219785 0.215997
chargesum: 0.00000
title: Mulliken charges with hydrogens summed into heavy atoms:
elementType: O O N N C C C C C C C C C C
charge: -0.187830 -0.224115 -0.179199 0.121878 0.135217 0.134459 -0.055002 0.116165 0.047555 -0.003971 -0.003728 -0.034655 -0.034208 0.167433
polarizability: 1.36397999e+02 5.38057771e+00 1.22869113e+02 -2.07900191e-03 4.00932486e-03 9.68058443e+01
1716.lowfreq: -27.1658 -8.4045 -0.0010 -0.0008 -0.0006 2.6643 17.8642 109.8112 206.7677
frequency: -25.1579 109.7564 206.7673 233.3567 247.3371 249.4586 306.3309 331.4578 337.6183 361.7393 386.3421 425.9897 480.1849 501.3800 538.1042 565.4054 637.4872 681.0127 685.3378 719.6139 766.9852 769.9032 829.3127 850.9447 854.6584 886.9186 907.3795 926.7343 937.3921 957.1724 975.2606 994.8322 1053.2184 1071.9490 1078.1108 1092.5054 1098.4777 1123.5117 1128.6401 1145.8769 1181.6549 1182.1537 1239.2647 1261.1170 1272.3443 1284.8087 1301.5063 1312.3338 1330.8141 1334.9051 1347.4694 1349.6115 1352.8116 1357.2168 1362.7289 1369.8496 1374.4497 1414.0733 1450.4794 1457.4239 1458.4304 1461.6366 1480.7833 1615.7311 2970.2416 2972.4851 2974.2905 2978.3133 2978.9368 2996.3153 2999.5615 3006.6299 3028.1918 3031.7077 3032.0614 3037.7021 3041.6437 3045.2334
redmass: 6.6341 6.0804 2.7126 5.3751 6.1221 3.6910 6.6142 2.1340 5.6538 3.2315 1.7898 2.2287 4.9580 3.1370 5.1691 4.0064 4.4437 5.6348 6.8688 5.6614 3.7635 2.6391 2.4729 3.3112 1.6804 2.3632 2.7665 2.0703 2.1879 2.3622 3.5354 2.9235 2.4908 1.8296 1.9495 1.9122 1.4594 1.7283 1.0794 1.0722 1.2022 2.0274 1.2832 1.4663 1.7946 1.6345 1.8797 1.7318 1.6847 1.3328 1.3179 1.5879 1.8346 1.5676 1.5317 1.7794 1.4553 1.9181 1.0758 1.0857 1.0840 1.0876 1.0919 10.2749 1.0672 1.0652 1.0615 1.0622 1.0640 1.0794 1.0811 1.0805 1.0998 1.0935 1.0981 1.1002 1.1005 1.1012
irintensity: 0.0117 4.1994 1.0069 0.1824 1.1221 0.0517 2.7869 0.2092 2.1697 0.0108 0.0947 0.8382 0.5871 3.7757 1.3845 4.9980 1.7868 19.9832 80.7742 2.4631 0.3309 1.0825 60.4275 57.0004 0.1612 4.6769 131.1873 5.1780 2.5716 13.3621 22.2506 76.1521 104.3405 0.6485 1.9095 0.2724 1.6361 8.9592 1.1253 0.5204 1.5112 48.5758 12.9974 1.0127 27.0129 0.2203 0.0113 3.1120 5.5856 0.2013 0.0522 8.6303 62.9703 29.6249 1.7238 43.7049 1.7602 16.3138 0.0306 6.3909 26.3371 25.3913 6.9423 188.7154 8.7174 7.4905 27.9095 3.6162 48.1574 123.7587 16.9734 79.5288 19.0468 3.1299 9.7433 64.7172 28.7438 43.6097
temp: 298.150 k
press: 1.00000 atm
elementType: 8 8 7 7 6 6 6 6 6 6 6 6 6 6 1 1 1 1 1 1 1 1 1 1 1 1 1 1
symmnumber: 1
zpe: 610701.8 jmol-1
zpe.correction: 0.232604 hartree
zpe.thermalcorrener: 0.242774 hartree
zpe.thermalcorrenthalpy: 0.243718 hartree
zpe.thermalcorrgfe: 0.197671 hartree
zpe.sumelectzpe: -648.295183 hartree
zpe.sumelectthermal: -648.285013 hartree
zpe.sumelectthermalent: -648.284068 hartree
zpe.sumelectthermalfe: -648.330115 hartree
dipole: 6.3178 -2.0695 0.0015
dipole: 6.6482
quadrupole: -96.8706 -87.6429 -78.2313
quadrupole: 3.8793 0.0028 0.0119
quadrupole: -9.2890 -0.0613 9.3503 3.8793 0.0028 0.0119
hfenergy: -648.5277867 hartree
pointgroup: C01 [X(C10H14N2O2)]
dipole: -2.5099237 0.7342226 0.050032 debye
polarizability: 135.9416419|5.6821127|123.0579656|-2.1017637|-2.2880389|97.0733487 unknown
InChI: InChI=1S/C10H14N2O2/c13-10-8-2-6-1-7(3-8)5-9(4-6)12(10)11-14/h6-9H,1-5H2
charge 0 multiplicity 1
28 atoms
O  1.737828 -2.235858 0.089008
O  3.114557 1.457816 -0.256587
N  1.314416 0.072957 -0.073154
N  2.746726 0.244622 -0.146251
C  -1.637713 0.529528 1.287262
C  -1.7483 0.327197 -1.231344
C  -2.5356 0.738951 0.039959
C  0.410293 1.256442 -0.129443
C  -0.604486 -1.574751 0.14116
C  -0.394008 1.445008 1.184892
C  -0.50346 1.237323 -1.383455
C  -1.268141 -0.969401 1.416817
C  -1.385834 -1.177259 -1.149689
C  0.901897 -1.30217 0.052279
H  -2.200803 0.819666 2.19693
H  -2.38881 0.47401 -2.123961
H  -3.458919 0.133098 0.127892
H  -2.847916 1.79961 -0.031251
H  1.116564 2.103842 -0.227799
H  -0.64101 -2.675658 0.231756
H  -0.728464 2.501367 1.213858
H  0.277434 1.298458 2.052112
H  0.092887 0.948552 -2.269833
H  -0.845506 2.277891 -1.553658
H  -2.197434 -1.543116 1.605893
H  -0.612957 -1.133113 2.294498
H  -0.814533 -1.4900 -2.045145
H  -2.327011 -1.762609 -1.154743
