program: Gaussian 09
title: 000027451
version: EM64L-G09RevD.01
frameworkgroup: C1[X(C13H8Br3NOS)]
method: RPBEPBE
basis: SDD
operation: Freq
keyword: #p
keyword: freq=noraman
keyword: PBEPBE/SDD
title: #p freq=noraman PBEPBE/SDD
converged: YES YES NO NO
title: Mulliken charges:
elementType: Br Br Br S O N C C C C C C C C C C C C C H H H H H H H H
charge: 0.063801 0.030453 0.024468 0.052224 -0.321030 -0.464032 0.414939 0.491755 0.216931 -0.409080 -0.293317 -0.168752 -0.235847 -0.314282 -0.441120 -0.163604 -0.160102 -0.148656 -0.240772 0.330092 0.239316 0.318981 0.230916 0.281032 0.254019 0.254569 0.157099
chargesum: 0.00000
title: Mulliken charges with hydrogens summed into heavy atoms:
elementType: Br Br Br S O N C C C C C C C C C C C C C
charge: 0.063801 0.030453 0.024468 0.209323 -0.321030 -0.133940 0.414939 0.491755 0.216931 -0.409080 -0.054001 -0.168752 -0.235847 0.004699 -0.210204 0.117428 0.093917 0.105913 -0.240772
polarizability: 4.14166050e+02 -1.67156705e+01 2.58319938e+02 5.61355887e+00 1.46180260e+01 8.27519907e+01
1716.lowfreq: -3.2723 -1.9722 -0.0015 -0.0015 -0.0009 1.4159 18.9759 25.6033 38.1414
frequency: 18.9700 25.5888 38.1412 56.1451 80.6766 97.1191 103.2722 132.4789 145.7515 150.8138 183.3662 204.6970 239.1716 272.6931 283.1505 297.7194 325.1996 353.3162 393.5213 402.3141 408.7035 459.3996 493.6101 514.2277 535.3788 553.5465 616.9780 630.6162 653.4859 666.6932 702.0965 708.4992 714.8789 741.9345 751.6563 817.6465 826.2114 848.5569 870.7716 886.0106 891.7027 917.4663 946.3991 986.1705 990.6716 1035.8454 1063.9700 1105.1323 1121.6041 1130.8928 1177.4705 1190.1925 1240.1050 1259.4864 1299.3417 1346.2396 1360.3378 1371.7006 1388.0281 1400.3213 1473.3329 1509.2920 1513.6412 1531.9412 1570.5178 1593.4582 1600.4288 1782.1180 3119.8061 3149.8135 3168.0188 3174.3487 3184.1028 3207.8844 3534.6316
redmass: 13.3921 5.3478 10.2600 11.7197 12.1411 21.1314 8.7159 11.0284 8.6501 13.5450 7.2765 7.2698 12.4641 7.7498 12.7833 7.9366 6.0234 6.5978 7.5535 8.9507 2.9747 5.6740 6.0739 2.8418 4.3639 7.5924 6.8364 6.6318 1.4354 1.6403 1.7146 3.4697 8.9216 8.1783 5.0526 1.4010 4.1826 1.4078 1.8441 3.5033 1.5149 1.4957 1.3634 1.3299 4.8091 5.2022 2.5692 5.1843 1.4521 1.7108 2.5961 1.1122 2.5339 1.8224 1.3851 3.9104 4.1912 5.3623 2.9836 3.7741 2.4970 3.5226 2.7472 5.0597 6.4286 4.2546 6.1025 1.1711 1.0906 1.0914 1.0917 1.0951 1.0935 1.0947 1.0758
irintensity: 0.1039 1.0870 0.2049 0.8168 2.6521 0.2295 2.6707 3.2230 1.7095 0.5116 15.7502 10.3073 5.3711 26.3310 3.0793 12.4646 0.5425 5.2312 81.3176 0.9772 0.6086 15.7646 22.6151 26.7600 10.8208 15.5951 1.5323 3.1992 42.7905 23.3734 40.4334 0.2287 68.8023 29.9606 19.5229 40.6611 34.7556 61.7629 25.0270 44.5505 5.7876 419.4691 1.4907 3.1655 50.7732 57.7378 32.2210 59.9585 31.4991 50.1895 13.8131 0.2611 57.8724 121.0645 28.3965 34.4467 32.9808 117.2756 33.0328 49.2379 152.3031 99.6927 678.1327 78.2712 2.8348 48.5133 0.9626 583.5022 12.6276 3.5175 2.6742 2.5753 0.4744 7.9325 15.9670
temp: 298.150 k
press: 1.00000 atm
elementType: 35 35 35 16 8 7 6 6 6 6 6 6 6 6 6 6 6 6 6 1 1 1 1 1 1 1 1
symmnumber: 1
zpe: 451838.0 jmol-1
zpe.correction: 0.172096 hartree
zpe.thermalcorrener: 0.190232 hartree
zpe.thermalcorrenthalpy: 0.191176 hartree
zpe.thermalcorrgfe: 0.120943 hartree
zpe.sumelectzpe: -1067.280544 hartree
zpe.sumelectthermal: -1067.262409 hartree
zpe.sumelectthermalent: -1067.261464 hartree
zpe.sumelectthermalfe: -1067.331697 hartree
dipole: -1.2273 3.3217 0.7759
dipole: 3.6252
quadrupole: -156.6360 -146.4683 -149.6793
quadrupole: 2.5927 -0.0192 3.8907
quadrupole: -5.7082 4.4595 1.2486 2.5927 -0.0192 3.8907
hfenergy: -1067.4526404 hartree
pointgroup: C01 [X(C13H8Br3N1O1S1)]
dipole: 0.414099 1.0514362 -0.8701778 debye
polarizability: 411.0265418|30.5254755|212.7615837|2.2555121|-79.9895826|131.4498535 unknown
InChI: InChI=1S/C13H8Br3NOS/c14-7-1-3-9(4-2-7)17-13(18)10-5-8(15)6-11(16)12(10)19/h1-6,17,19H
charge 0 multiplicity 1
27 atoms
Br -5.442922 -2.098344 0.456509
Br -3.771136 3.019089 -1.610659
Br 6.942619 0.409544 -0.167605
S  -2.343795 -2.71153 1.375233
O  0.213384 -1.37145 1.28373
N  0.745643 0.200108 -0.343992
C  -1.623707 -0.217575 0.141325
C  2.168791 0.196386 -0.252862
C  -0.175463 -0.499693 0.414036
C  -2.652716 -1.168833 0.485849
C  -1.978845 1.023348 -0.463723
C  -3.988469 -0.845403 0.096427
C  -3.310346 1.299653 -0.795507
C  2.894581 -0.538674 0.721504
C  2.871334 0.98912 -1.200451
C  -4.33138 0.360572 -0.537778
C  4.30389 -0.469461 0.741293
C  4.277718 1.055347 -1.181568
C  4.984794 0.322641 -0.204786
H  0.367024 0.766748 -1.105755
H  -1.227553 1.803199 -0.621548
H  2.36021 -1.156978 1.443004
H  2.322371 1.561194 -1.9592
H  -5.369712 0.570162 -0.804784
H  4.861182 -1.035471 1.492975
H  4.809684 1.667909 -1.914381
H  -0.965878 -2.29221 1.594914
