program: Gaussian 09
title: 000286674
version: EM64L-G09RevD.01
frameworkgroup: C1[X(C23H20O3)]
method: RPBEPBE
basis: SDD
operation: Freq
keyword: #pfreq=noraman
keyword: PBEPBE/SDD
title: #p freq=noraman PBEPBE/SDD
converged: YES YES NO NO
title: Mulliken charges:
elementType: O O O C C C C C C C C C C C C C C C C C C C C C C C H H H H H H H H H H H H H H H H H H H H
charge: -0.475362 -0.207078 -0.221902 0.009480 -0.489272 0.385867 -0.520608 0.068418 0.256653 0.120867 -0.381862 -0.407226 0.277903 -0.241348 -0.234204 -0.317280 -0.354485 -0.241857 -0.340817 -0.348010 -0.256540 -0.237184 -0.225381 -0.251448 -0.232462 -0.224588 0.258185 0.249114 0.255789 0.254666 0.263675 0.286175 0.352572 0.228695 0.226456 0.287013 0.275981 0.229213 0.251520 0.278115 0.230808 0.233020 0.232657 0.230281 0.232965 0.232822
chargesum: 0.00000
title: Mulliken charges with hydrogens summed into heavy atoms:
elementType: O O O C C C C C C C C C C C C C C C C C C C C C C C
charge: -0.122789 -0.207078 -0.221902 0.009480 0.018027 0.385867 -0.010153 0.068418 0.256653 0.120867 -0.118187 -0.121051 0.277903 -0.012654 -0.007748 -0.030267 -0.078504 -0.012644 -0.089296 -0.069894 -0.025731 -0.004164 0.007277 -0.021167 0.000503 0.008234
polarizability: 3.16340835e+02 2.22659849e+01 2.46575446e+02 6.21566751e+00 -3.07628863e+01 1.90792140e+02
1716.lowfreq: -13.4510 -5.7105 -3.4440 -0.0009 -0.0005 0.0005 9.1590 14.7537 23.6472
frequency: 8.9993 14.7348 23.5018 33.6570 40.8449 50.9319 56.6356 87.6779 114.1318 118.2722 145.2788 154.3056 165.5235 186.1683 204.1185 245.4841 267.4320 273.1489 314.2491 346.1492 358.4297 384.2855 398.7377 400.0204 404.7222 411.1331 417.5321 448.3365 477.6020 490.6631 508.1149 570.6749 578.8506 613.2699 613.6780 615.5624 637.9583 655.6047 689.2187 694.6529 697.0094 700.9921 711.8774 754.6605 766.2144 781.5446 792.2333 816.4709 836.8445 855.4956 859.8384 866.3288 907.5370 939.0458 944.1834 949.3000 979.7623 988.4617 989.0170 989.7829 989.9268 991.3394 991.6645 1000.6075 1006.2940 1007.6078 1011.1589 1024.1042 1026.9672 1032.0181 1046.5256 1071.6250 1084.1065 1087.4480 1092.2608 1108.0664 1144.3242 1152.5426 1172.6723 1172.8244 1173.8600 1187.9417 1189.6276 1194.7064 1212.9721 1242.8580 1251.9717 1290.4788 1311.0895 1316.9374 1321.3140 1330.7404 1356.0544 1380.5797 1385.9431 1387.3021 1432.8319 1434.4308 1435.2738 1436.6952 1460.6165 1475.9590 1479.3943 1480.6545 1550.7267 1569.4341 1587.5669 1590.1229 1598.5311 1607.4056 1610.5321 1612.5257 2966.3364 3007.6322 3031.0346 3086.6925 3123.7652 3127.9373 3128.2971 3130.6881 3138.1889 3141.4449 3143.6941 3149.4666 3154.5979 3158.8479 3159.0577 3166.4904 3168.9654 3170.0356 3199.3880 3569.1391
redmass: 5.7990 6.0355 4.5580 5.3549 3.9077 5.0656 4.3260 5.6623 3.8227 5.9202 4.3339 7.0792 2.9595 3.6294 4.7170 4.6594 5.1219 5.1871 1.4400 2.4217 5.9256 7.0255 2.8587 2.8122 2.9038 4.5479 3.2615 4.3804 5.3494 3.6817 4.7105 3.0597 3.5468 6.4274 6.4522 6.4198 6.4103 6.5487 2.8146 5.3218 1.8291 2.1054 1.7484 1.5034 1.8968 3.1425 2.0161 2.8540 4.4783 1.2536 1.2499 1.2447 2.7507 1.4347 1.4147 1.5180 5.3571 2.3766 2.6530 2.3147 5.4043 1.4806 1.7733 1.4824 1.9430 1.3475 1.5710 2.4154 2.0878 2.0328 2.5074 2.8709 1.6193 1.6072 1.9789 2.9618 1.5741 1.5165 1.0678 1.0647 1.0591 1.1272 1.1304 1.1433 2.0382 4.5070 1.3183 1.7219 1.5209 1.3491 1.3294 1.4455 1.6986 8.1333 8.7664 9.2487 1.3797 2.2599 2.1957 1.6353 1.0980 2.1800 2.1918 2.1829 9.4152 6.8168 6.5021 6.2287 6.7390 5.9811 6.0890 6.4841 1.0632 1.0669 1.0926 1.0962 1.0849 1.0851 1.0855 1.0885 1.0881 1.0896 1.0937 1.0925 1.0944 1.0960 1.0969 1.0994 1.1013 1.0982 1.0941 1.0659
irintensity: 1.5774 0.8737 0.4548 0.2519 0.2579 1.1486 0.3179 3.0591 1.2345 1.9248 0.0765 0.3826 1.1044 0.9720 3.0714 0.7878 10.2141 15.9284 155.6515 79.4793 2.1981 8.1538 0.3355 0.1445 1.2430 1.1915 2.3257 8.7005 12.5427 1.4097 8.4611 40.8669 33.6512 0.4069 0.1143 0.4794 34.6565 12.2109 18.6736 0.6907 43.2957 61.9808 71.2721 54.5436 53.0959 8.4727 7.2811 11.6223 22.9977 0.9743 0.7401 0.0924 34.1264 2.9380 1.0741 7.2327 66.9777 0.2634 0.3824 1.5971 7.8684 0.3516 1.3619 0.1366 7.2144 0.5700 1.5535 6.2873 5.5442 3.5696 20.6935 17.8359 3.5827 9.2667 4.9897 7.4330 41.6162 1.7743 2.6352 2.7507 1.7538 28.6981 28.4988 8.6245 54.9310 257.0773 27.8443 139.4989 4.7741 8.9095 0.2915 17.3683 46.1750 0.7243 4.6996 2.5425 13.3611 18.4520 21.0981 17.6914 14.0302 0.4509 2.2075 21.2320 127.7115 89.2489 14.6080 0.2308 39.6123 18.2723 4.5458 11.8225 40.6022 10.3424 6.9703 8.9740 0.7041 0.1865 0.4137 5.5599 5.9525 12.9958 19.1483 19.0154 14.8188 22.1216 22.1888 31.9994 21.8695 11.6447 4.5446 9.0633
temp: 298.150 k
press: 1.00000 atm
elementType: 8 8 8 6 6 6 6 6 6 6 6 6 6 6 6 6 6 6 6 6 6 6 6 6 6 6 1 1 1 1 1 1 1 1 1 1 1 1 1 1 1 1 1 1 1 1
symmnumber: 1
zpe: 953302.6 jmol-1
zpe.correction: 0.363094 hartree
zpe.thermalcorrener: 0.386102 hartree
zpe.thermalcorrenthalpy: 0.387046 hartree
zpe.thermalcorrgfe: 0.306279 hartree
zpe.sumelectzpe: -1112.291601 hartree
zpe.sumelectthermal: -1112.268593 hartree
zpe.sumelectthermalent: -1112.267649 hartree
zpe.sumelectthermalfe: -1112.348416 hartree
dipole: -0.0510 3.0246 -2.8610
dipole: 4.1636
quadrupole: -122.0252 -148.2663 -151.0432
quadrupole: 8.9100 1.5917 3.3509
quadrupole: 18.4198 -7.8214 -10.5983 8.9100 1.5917 3.3509
hfenergy: -1112.654695 hartree
pointgroup: C01 [X(C23H20O3)]
dipole: -0.0589392 1.0114155 -1.2872154 debye
polarizability: 314.9043127|25.1127664|237.9602575|3.3470178|-37.5657609|200.8438502 unknown
InChI: InChI=1S/C23H20O3/c24-21(18-10-4-1-5-11-18)16-17-23(26,20-14-8-3-9-15-20)22(25)19-12-6-2-7-13-19/h1-15,26H,16-17H2
charge 0 multiplicity 1
46 atoms
O  -0.926311 -0.812155 -1.404014
O  -2.030298 -1.344397 1.980004
O  2.835408 -2.296529 0.997822
C  -0.910808 -0.414633 0.020058
C  0.380714 -0.965925 0.685368
C  -0.957425 1.122608 0.058063
C  1.653482 -0.382796 0.051566
C  -2.169477 -0.972889 0.776686
C  -3.512106 -1.048858 0.110041
C  2.910883 -1.185256 0.392841
C  -1.078231 1.783357 1.307406
C  -0.84422 1.891096 -1.125566
C  4.249417 -0.63857 -0.027351
C  -1.083698 3.193652 1.370035
C  -0.850133 3.302983 -1.059616
C  -3.820487 -0.421255 -1.129516
C  -4.537048 -1.757234 0.800475
C  -0.969484 3.960056 0.186472
C  4.386022 0.573998 -0.756287
C  5.416468 -1.375106 0.314636
C  -5.125663 -0.504887 -1.659102
C  -5.834731 -1.84781 0.263032
C  -6.133534 -1.219636 -0.970887
C  5.664126 1.038007 -1.134798
C  6.691832 -0.910351 -0.060805
C  6.819006 0.298773 -0.787531
H  0.351767 -0.756061 1.766962
H  0.39322 -2.069992 0.601462
H  1.548673 -0.364015 -1.054146
H  1.79315 0.671356 0.357662
H  -1.175902 1.196077 2.228117
H  -0.748112 1.376208 -2.085642
H  -0.855179 -1.798916 -1.452447
H  -1.180824 3.693038 2.340468
H  -0.761077 3.888775 -1.981748
H  -3.044771 0.122913 -1.670473
H  -4.286767 -2.222637 1.759542
H  -0.976446 5.054681 0.235488
H  3.501183 1.156541 -1.032409
H  5.289148 -2.307561 0.874729
H  -5.357011 -0.013341 -2.610336
H  -6.612952 -2.400491 0.800507
H  -7.14401 -1.285357 -1.390185
H  5.761651 1.972703 -1.69776
H  7.58554 -1.483597 0.209003
H  7.810615 0.66173 -1.080622
