program: Gaussian 09
title: 000286681
version: EM64L-G09RevD.01
frameworkgroup: C1[X(C12H16N6O5)]
method: RPBEPBE
basis: SDD
operation: Freq
keyword: #p
keyword: freq=noraman
keyword: PBEPBE/SDD
title: #p freq=noraman PBEPBE/SDD
converged: YES YES NO NO
title: Mulliken charges:
elementType: O O O O O N N N N N N C C C C C C C C C C C C H H H H H H H H H H H H H H H H
charge: -0.287444 -0.454155 -0.469740 -0.438341 -0.337274 -0.141017 -0.106014 -0.138381 -0.381685 -0.627585 -0.503017 -0.057174 -0.146455 -0.251000 -0.037829 -0.341526 0.112666 -0.326817 0.012601 0.183735 0.177649 0.185545 -0.379694 0.244145 0.256266 0.301435 0.258235 0.213074 0.218294 0.249117 0.369076 0.366472 0.353122 0.239433 0.400005 0.328266 0.343133 0.321012 0.291867
chargesum: 0.00000
title: Mulliken charges with hydrogens summed into heavy atoms:
elementType: O O O O O N N N N N N C C C C C C C C C C C C
charge: -0.287444 -0.085080 -0.103268 -0.085219 -0.337274 -0.141017 -0.106014 -0.138381 0.018320 0.043814 0.109862 0.186971 0.109810 0.050434 0.220406 0.089842 0.112666 -0.077700 0.012601 0.183735 0.177649 0.185545 -0.140261
polarizability: 2.71643606e+02 -9.05198296e+00 2.14643919e+02 1.21431306e+01 8.41319636e+00 1.17003433e+02
1716.lowfreq: -7.7757 -3.7331 -0.0007 -0.0006 -0.0002 6.2079 25.5319 26.5734 41.2742
frequency: 25.4711 26.3727 41.2638 60.9268 78.3716 93.5400 97.5445 107.7938 151.1173 175.4148 179.3137 193.6490 196.5322 217.7774 237.8540 251.4480 267.4781 292.3712 301.7579 306.9815 310.0395 339.5411 352.8967 366.9997 391.4808 452.5622 458.0963 487.1721 506.2174 532.4015 550.3318 552.9914 561.5269 584.9922 591.4495 622.8093 625.8781 654.2193 676.2488 718.0307 718.3060 730.9292 749.4028 776.2125 792.0335 805.3901 811.0458 828.7162 875.7098 901.5625 924.9832 933.9335 942.9420 972.8992 989.6992 1001.3428 1011.4477 1022.7596 1040.6677 1057.5445 1066.6393 1106.3835 1132.5320 1160.6900 1164.1357 1179.9304 1184.6186 1205.7367 1215.5107 1256.9993 1265.8871 1275.3574 1284.7299 1290.4861 1304.1391 1315.1974 1326.7913 1339.3345 1346.3044 1350.5804 1367.6822 1382.9910 1391.3572 1395.5324 1405.9339 1433.1258 1452.7940 1462.0259 1486.0687 1504.6489 1548.5393 1574.0674 1616.3601 1634.2908 1652.4888 2970.4566 3023.3102 3027.5656 3049.4841 3065.4796 3077.3430 3151.4494 3160.7867 3212.9275 3362.5829 3402.3880 3495.2699 3535.7812 3550.3241 3595.1836 3688.0664
redmass: 6.5728 6.3261 5.4100 5.6678 5.2357 5.6575 6.0235 4.6270 5.9533 4.5884 3.7127 5.1951 5.1749 2.1696 2.1732 2.3116 4.1414 3.5557 5.9271 3.5919 2.5421 4.5521 4.7125 3.2084 3.9113 1.2092 1.3578 7.4993 3.1033 4.0657 4.0833 2.2949 2.3361 3.3233 1.3168 4.7362 2.5880 6.2836 4.6490 5.0993 3.1772 5.5429 5.7837 3.1523 4.2713 3.8349 3.3225 2.3012 3.5934 1.1694 4.1598 1.4727 3.7671 4.5464 3.3001 5.6401 3.4593 2.4420 3.1804 1.9241 4.1785 2.1243 2.8770 1.8003 2.5085 1.6718 1.5251 1.7415 1.2982 1.7047 1.2940 1.4547 1.6515 1.3362 1.3373 1.4418 4.9946 1.4782 1.6801 3.0375 1.6425 1.2834 1.7331 1.5723 2.3763 4.0791 2.2279 1.0873 4.3372 5.6372 4.8538 3.8548 2.0829 1.8587 1.1073 1.0665 1.0845 1.0873 1.0864 1.0883 1.0980 1.0915 1.0907 1.0976 1.0430 1.0644 1.0985 1.0452 1.0655 1.0669 1.1042
irintensity: 1.9395 0.8607 3.6959 6.2650 12.0320 10.7814 1.3271 0.1816 1.5078 22.3574 0.9142 5.6118 7.3482 51.8276 57.2625 24.8637 17.5151 9.9169 14.3770 3.2720 19.7350 28.2798 2.0036 14.4600 0.3156 153.8438 55.1353 3.2284 10.6111 2.7955 31.8245 54.6932 94.8518 7.3313 122.9695 27.9787 2.7000 10.5777 42.4502 114.4841 71.4065 20.9090 6.4647 12.3633 22.9552 175.2994 87.6478 186.2858 25.8293 152.1100 170.7433 5.7929 95.1484 131.2428 107.9845 25.5644 65.7698 11.0356 47.0642 4.0943 19.4509 9.2735 38.3143 8.4345 27.4319 24.3224 43.0611 87.4433 10.1751 6.9527 14.8251 2.3488 94.6682 18.9828 21.2851 37.8324 4.8718 82.4409 40.3528 78.2669 96.5125 21.8285 20.2309 24.2777 10.5821 180.1404 69.9171 5.5222 5.2628 171.8419 19.7426 403.6948 356.5825 89.3682 39.3346 33.1739 42.0471 28.8334 15.1297 5.2848 34.2269 67.7138 414.1832 1.5517 12.1280 69.3317 12.3399 67.7575 7.8852 23.5897 32.1783
temp: 298.150 k
press: 1.00000 atm
elementType: 8 8 8 8 8 7 7 7 7 7 7 6 6 6 6 6 6 6 6 6 6 6 6 1 1 1 1 1 1 1 1 1 1 1 1 1 1 1 1
symmnumber: 1
zpe: 783402.6 jmol-1
zpe.correction: 0.298382 hartree
zpe.thermalcorrener: 0.319949 hartree
zpe.thermalcorrenthalpy: 0.320893 hartree
zpe.thermalcorrgfe: 0.247211 hartree
zpe.sumelectzpe: -1169.765976 hartree
zpe.sumelectthermal: -1169.744409 hartree
zpe.sumelectthermalent: -1169.743465 hartree
zpe.sumelectthermalfe: -1169.817148 hartree
dipole: 0.2873 1.8994 -1.2999
dipole: 2.3195
quadrupole: -145.5676 -111.1114 -144.2460
quadrupole: 16.4382 22.3437 8.0670
quadrupole: -11.9259 22.5303 -10.6044 16.4382 22.3437 8.0670
hfenergy: -1170.0643585 hartree
pointgroup: C01 [X(C12H16N6O5)]
dipole: -0.0177665 -0.0338441 0.9117645 debye
polarizability: 262.9149252|-34.5241248|162.7415106|17.2082604|44.7954028|177.6345228 unknown
InChI: InChI=1S/C12H16N6O5/c13-9(22)4-1-18(11-6(4)10(17-14)15-3-16-11)12-8(21)7(20)5(2-19)23-12/h1,3,5,7-8,12,17,19-21H,2,13-14H2
charge 0 multiplicity 1
39 atoms
O  2.735601 0.812737 0.012018
O  3.342282 -1.641684 1.9928
O  4.08095 -2.513356 -0.389529
O  3.817006 1.593768 -2.51088
O  -3.714718 2.367028 1.462594
N  0.538642 0.437471 0.932914
N  -0.067723 -0.965347 -1.006516
N  -2.393324 -0.718939 -1.726979
N  -3.914067 0.740645 -0.688717
N  -2.155186 3.199915 2.932932
N  -4.961224 0.213913 -1.496705
C  1.968669 0.120378 1.061278
C  2.330776 -1.381843 0.973013
C  2.954581 -1.562014 -0.448326
C  3.510311 -0.169605 -0.80591
C  3.330493 0.23376 -2.271824
C  -0.359397 -0.035455 -0.039781
C  -0.124685 1.370416 1.730342
C  -1.610109 0.609128 0.168821
C  -1.455749 1.506226 1.30227
C  -2.655631 0.230854 -0.751078
C  -2.503253 2.367677 1.887596
C  -1.142813 -1.246693 -1.799529
H  2.294318 0.500627 2.045381
H  1.450063 -2.030395 1.129497
H  2.168782 -1.87976 -1.15355
H  4.573817 -0.098349 -0.508878
H  2.259619 0.132312 -2.547404
H  3.942481 -0.417662 -2.919048
H  0.411951 1.855828 2.544366
H  4.054396 -2.181543 1.542287
H  3.785131 -3.404762 -0.698688
H  3.350438 2.188373 -1.868171
H  -0.981765 -1.98774 -2.589057
H  -4.145386 1.370043 0.11215
H  -1.209817 3.268894 3.301022
H  -2.888142 3.782069 3.336118
H  -4.573639 -0.588621 -2.019901
H  -5.325981 0.940607 -2.129429
