program: Gaussian 09
title: 000286617
version: EM64L-G09RevD.01
frameworkgroup: C1[X(C7H6Cl2N2O)]
method: RPBEPBE
basis: SDD
operation: Freq
keyword: #p
keyword: freq=noraman
keyword: PBEPBE/SDD
title: #p freq=noraman PBEPBE/SDD
converged: YES YES NO NO
title: Mulliken charges:
elementType: Cl Cl O N N C C C C C C C H H H H H H
charge: -0.055122 -0.058509 -0.336832 -0.665900 -0.636945 0.239370 0.405768 -0.268460 -0.275988 -0.155499 -0.257717 0.200261 0.214229 0.280759 0.314632 0.387134 0.325237 0.343579
chargesum: 0.00000
title: Mulliken charges with hydrogens summed into heavy atoms:
elementType: Cl Cl O N N C C C C C C C
charge: -0.055122 -0.058509 -0.336832 0.035866 0.031871 0.239370 0.405768 -0.054230 -0.275988 -0.155499 0.023042 0.200261
polarizability: 1.49123516e+02 -4.22722662e+00 1.54815957e+02 2.71268944e-02 -3.25083437e-02 4.30784212e+01
1716.lowfreq: -27.3568 -7.1703 -0.0011 0.0017 0.0019 2.4235 6.2615 101.5866 129.0705
frequency: -27.3167 101.5865 129.0699 166.3659 185.7364 192.4482 321.7715 322.3028 348.7259 364.5039 403.7400 413.9666 416.3536 467.8589 530.2132 536.5640 541.9805 581.5076 628.1752 691.7597 700.2756 756.4604 786.9176 815.0314 848.4737 849.5440 871.8142 1038.5620 1070.2819 1111.6078 1124.1757 1252.2580 1307.1848 1349.7180 1407.1728 1414.3819 1451.5220 1513.3280 1558.1085 1589.9396 1623.8046 1634.5325 3161.6684 3183.1808 3321.0506 3543.3695 3619.3919 3695.7049
redmass: 4.1995 9.0757 7.2209 11.5758 4.5474 13.5205 5.9291 5.6075 14.6342 5.9827 4.6685 1.6711 7.6534 2.2871 1.1451 3.2219 2.7552 1.3243 4.3941 6.4090 9.0936 3.9996 5.2683 1.1585 1.6458 6.3148 1.3636 2.0947 1.8977 1.8480 3.6612 1.3220 2.7205 3.9276 6.0454 4.9914 2.5753 3.9852 6.0107 1.4011 3.9083 1.8449 1.0911 1.0938 1.0601 1.0455 1.0913 1.1035
irintensity: 11.6914 1.2167 1.4585 2.1752 0.7302 0.7626 13.7858 0.9537 1.6265 5.7073 6.5699 34.7972 1.7949 56.1743 103.7282 1.2592 39.3191 201.7414 35.4703 2.9566 77.7415 4.6040 9.3105 172.8562 22.2299 18.9280 8.7614 1.4516 62.2228 6.4807 16.6964 29.2700 30.8509 271.2697 57.5518 36.4257 36.0159 365.8032 37.5753 182.6840 96.5990 180.7900 5.3615 0.6190 181.6001 62.1251 87.2640 33.9479
temp: 298.150 k
press: 1.00000 atm
elementType: 17 17 8 7 7 6 6 6 6 6 6 6 1 1 1 1 1 1
symmnumber: 1
zpe: 322657.3 jmol-1
zpe.correction: 0.122894 hartree
zpe.thermalcorrener: 0.133306 hartree
zpe.thermalcorrenthalpy: 0.134250 hartree
zpe.thermalcorrgfe: 0.086486 hartree
zpe.sumelectzpe: -1374.361356 hartree
zpe.sumelectthermal: -1374.350943 hartree
zpe.sumelectthermalent: -1374.349999 hartree
zpe.sumelectthermalfe: -1374.397764 hartree
dipole: -0.8538 -1.7435 0.0115
dipole: 1.9414
quadrupole: -88.0342 -70.1337 -87.1157
quadrupole: 7.9047 -0.0313 -0.0361
quadrupole: -6.2730 11.6275 -5.3545 7.9047 -0.0313 -0.0361
hfenergy: -1374.4842494 hartree
pointgroup: C01[X(C7H6Cl2N2O1)]
dipole: -0.5102623 -0.5382374 0.1825549 debye
dipolederiv: -0.291915 -0.2561292 0.0835465 -0.2753817 -0.5891625 0.1530889 0.0879785 0.1513193 -0.1028041 -0.3489012 0.2995054 -0.043993 0.3604342 -0.5959048 0.0922087 -0.0585038 0.0978811 -0.0812633 -0.9763809 0.2183045 0.0037183 0.1714645 -0.8094759 0.0863479 0.0161432 0.0819276 -0.4093663 -0.5532352 0.4981041 -0.1240854 0.3833701 -1.143489 0.0908272 -0.0971605 0.0789926 -0.6219285 -0.7214179 -0.4906808 0.1224439 -0.5728331 -0.9140967 0.1084273 0.1425341 0.1005569 -0.7315309 -0.8379398 -0.3549707 0.1619293 0.387515 -0.1375578 -0.0134596 -0.0160705 0.0575912 -0.0525347 0.1942119 -0.7661782 0.1776426 -0.5745075 0.8239524 -0.1102651 0.1314053 -0.0922385 0.144142 0.3271683 0.2211771 -0.0935354 -0.2143507 -0.2146492 0.0487306 0.0121888 0.0071094 -0.1015178 0.3334233 0.8615538 -0.2481588 0.4051139 0.6209258 -0.2126477 -0.1389669 -0.2560047 -0.0334787 0.0244645 -0.6258909 0.1363936 -0.6919279 0.64764 -0.1141018 0.1516245 -0.120366 -0.0975215 -0.1264781 -0.0126481 0.0124921 0.2743005 -0.0143487 -0.0300218 -0.0559147 -0.0024202 -0.0222204 1.8295834 0.3708403 -0.2417921 0.3175935 1.2431584 -0.2711022 -0.2302936 -0.2757669 0.3470662 0.0587338 -0.0923964 0.0313262 -0.0810047 -0.0144295 0.0482939 0.028259 0.0493189 0.1415559 0.0230242 -0.0069453 0.0154965 -0.0037933 0.1237523 0.010656 0.0147393 0.0109944 0.1629775 0.1993088 -0.0454095 0.0261308 -0.0421774 0.2792001 0.023505 0.0256277 0.0238446 0.3527186 0.4156568 0.0534902 -0.0182043 0.0378574 0.325566 0.0051179 -0.0142183 0.0040533 0.3641319 0.2231789 0.0813105 -0.0048972 0.0859306 0.1776197 0.040933 -0.0062639 0.0414554 0.3700081 0.2275143 0.0469632 0.0035463 0.0323964 0.1912994 0.0434619 0.0068919 0.0417516 0.371566 unknown
polarizability: 146.4011448|-4.2500983|150.6144413|-8.9414916|-25.3281784|50.002308 unknown
InChI: InChI=1S/C7H6Cl2N2O/c8-3-1-4(7(11)12)6(10)5(9)2-3/h1-2H,10-11H2
charge 0 multiplicity 1
18 atoms
Cl 2.182567 2.711013 -0.683383
Cl 2.414565 -2.697451 0.584023
O  -2.961459 0.962392 0.225712
N  -0.801457 2.346522 -0.311717
N  -2.848548 -1.268112 0.75664
C  -0.745506 -0.055108 0.257746
C  -0.097118 1.189672 -0.102276
C  0.042976 -1.222041 0.460079
C  1.331429 1.156811 -0.231127
C  1.432983 -1.183125 0.317453
C  2.102658 0.011291 -0.031577
C  -2.23237 -0.080331 0.408275
H  -0.416147 -2.176886 0.730473
H  3.189142 0.040351 -0.14288
H  -0.309704 3.201954 -0.562568
H  -1.825998 2.286008 -0.200731
H  -2.356012 -2.140601 0.922639
H  -3.863097 -1.24846 0.849319
