program: Gaussian 09
title: 000286738
version: EM64L-G09RevD.01
frameworkgroup: C1[X(C20H20Cl2N8O5)]
method: RPBEPBE
basis: SDD
operation: Freq
keyword: #p
keyword: freq=noraman
keyword: PBEPBE/SDD
title: #p freq=noraman PBEPBE/SDD
converged: YES YES NO NO
title: Mulliken charges:
elementType: Cl Cl O O O O O N N N N N N N N C C C C C C C C C C C C C C C C C C C C H H H H H H H H H H H H H H H H H H H H
charge: -0.069379 -0.038095 -0.397817 -0.225658 -0.235899 -0.419649 -0.226288 -0.133140 -0.388324 -0.044076 0.050454 -0.026292 -0.086420 -0.607177 -0.576979 -0.128404 -0.391283 0.450980 -0.487863 -0.627109 0.442372 0.126847 -0.313758 -0.372168 -0.323774 -0.323434 0.116690 0.301372 -0.653071 0.182117 -0.434054 -0.105774 -0.039108 0.149391 -0.031348 0.309456 0.281993 0.254903 0.355960 0.274678 0.256818 0.240122 0.259715 0.293424 0.271860 0.229237 0.243275 0.239632 0.240034 0.390560 0.377245 0.336351 0.356942 0.334075 0.339833
chargesum: 0.00000
title: Mulliken charges with hydrogens summed into heavy atoms:
elementType: Cl Cl O O O O O N N N N N N N N C C C C C C C C C C C C C C C C C C C C
charge: -0.069379 -0.038095 -0.007256 -0.225658 -0.235899 -0.042403 -0.226288 -0.133140 -0.032364 -0.044076 0.050454 -0.026292 -0.086420 0.086116 0.096930 0.181052 0.145613 0.450980 0.043633 -0.127272 0.442372 0.126847 -0.020333 -0.100308 -0.323774 -0.323434 0.116690 0.301372 0.059074 0.182117 -0.194020 -0.105774 -0.039108 0.149391 -0.031348
polarizability: 3.93173901e+02 -9.87610649e+00 3.80373616e+02 -2.81158101e+01 6.46523759e+00 2.21485100e+02
1716.lowfreq: -0.0005 0.0010 0.0013 3.3505 3.7939 6.0168 10.0974 10.8588 17.3341
frequency: 10.0006 10.6295 17.3191 19.5617 22.0936 28.4757 33.0191 38.9581 50.6217 52.6745 75.8152 84.9608 92.4857 102.6343 109.8564 117.4877 121.5812 143.5535 162.0584 165.8372 169.4778 182.2709 193.1032 204.5680 211.1347 214.2109 226.6440 236.1710 265.7176 283.3136 304.0508 313.2240 316.0022 327.7548 354.3721 386.7528 399.5566 421.6774 436.3404 438.3872 458.5972 468.7379 486.5591 503.5587 506.4427 506.5969 510.9177 523.3448 536.3056 545.2894 553.3218 559.7669 566.1968 572.4328 578.1563 585.1502 604.4231 616.1150 622.0045 629.5231 641.6358 644.2260 649.7969 681.7265 707.2878 720.7872 723.2932 737.3311 747.8448 749.4932 770.6435 787.9660 812.2352 829.3913 832.9206 833.7818 853.3503 878.7673 896.7391 905.7955 922.6931 929.5871 931.6395 964.8832 987.0377 1017.8024 1031.5552 1035.3833 1051.1141 1061.0956 1096.9545 1100.0185 1106.3109 1111.3983 1123.1689 1132.4998 1173.1734 1190.7753 1207.3867 1210.8108 1225.3734 1237.8215 1245.5310 1255.6264 1263.1230 1273.6500 1274.8995 1288.7297 1292.2542 1332.7172 1339.2121 1350.4030 1354.0857 1359.8255 1373.5025 1378.6242 1383.0339 1411.9377 1423.3967 1442.3877 1445.3002 1449.4637 1469.9608 1471.8697 1474.8919 1475.6213 1479.9080 1493.2001 1506.6388 1515.5896 1523.2338 1526.9336 1558.7090 1597.5212 1602.1253 1619.9379 1628.3509 1649.7292 1670.1514 2951.8154 2989.3943 3005.8550 3008.9727 3024.4215 3036.0980 3045.2931 3065.8882 3100.4174 3103.2690 3107.5344 3178.9390 3191.7619 3505.2393 3511.5175 3518.0664 3526.0461 3554.2300 3679.7565 3714.4963
redmass: 7.9644 7.8402 7.3500 12.6678 11.1588 7.8882 8.5859 11.1092 5.1264 9.3644 6.1743 9.9658 4.1538 3.2707 4.5695 9.0182 7.9860 6.3965 1.5119 5.4723 11.4489 5.6280 4.6096 6.3359 4.1240 4.2664 3.2660 6.6998 6.9733 3.9998 4.6939 4.2882 3.7526 5.7931 6.0995 6.7824 3.8159 5.2738 6.2271 4.9864 5.6255 4.7541 4.8304 1.1999 5.3642 1.8793 5.3041 3.8231 4.1863 4.6393 2.6749 2.8155 1.3827 1.3818 3.2182 4.5535 1.3809 1.8587 3.6798 1.5246 1.3394 6.9292 1.3681 6.7874 4.5441 7.3014 7.6276 5.0768 9.1827 7.9518 2.4945 2.7034 6.5411 8.6514 3.5893 1.8049 1.5396 4.0784 4.4922 3.2240 2.0315 2.0839 2.5637 3.3416 2.4831 3.8994 2.8041 3.2654 2.7952 2.1629 3.3190 2.4635 2.0127 1.2972 2.9134 2.2297 1.6254 1.5946 2.2330 2.3886 1.3642 2.3669 1.4545 3.4210 1.6774 1.6868 2.8856 3.2928 1.2351 1.4833 2.0659 2.5735 2.1492 2.5216 2.8093 3.9767 1.7791 3.8905 3.5679 1.0976 1.3916 3.6420 1.2189 1.1713 1.8091 1.8905 1.3099 1.4486 3.2166 2.0624 6.5774 4.0846 2.9436 9.0096 1.6733 4.0004 2.8100 8.4662 8.1709 1.0392 1.0625 1.0606 1.0817 1.0996 1.0623 1.0957 1.1032 1.1038 1.0955 1.0920 1.0924 1.0913 1.0784 1.0639 1.0643 1.0448 1.0443 1.1049 1.1060
irintensity: 0.4617 0.3506 1.1338 0.2970 0.3544 1.0792 1.1226 3.1576 1.0339 0.3504 1.6781 0.8461 0.7786 1.1484 1.4047 0.0712 1.4809 2.5813 1.5730 6.5841 1.4759 2.1406 8.8008 7.8367 1.4098 1.1190 2.7097 1.2796 1.6182 8.7804 5.6593 0.7326 7.1913 1.3063 3.8607 14.0882 1.3537 7.7372 21.1689 7.1291 7.6758 12.5979 27.8690 213.9213 3.5238 35.6787 2.0045 36.7707 16.3664 1.4545 22.5932 89.4016 35.3383 129.9118 6.6105 20.0838 70.8843 84.9491 23.1088 41.0888 126.4724 3.6327 97.2343 8.4531 16.3076 13.7299 6.3867 3.8597 41.7695 55.4776 16.0904 38.4768 8.4783 6.5494 11.3152 20.5874 50.4932 7.0282 9.9371 2.5747 33.2680 15.7465 12.4608 12.3942 46.8250 182.1461 63.1064 8.4819 143.1889 126.4990 27.7756 43.9683 16.0664 0.4660 48.3757 0.3210 15.0539 16.3798 20.7231 65.1752 3.7058 7.8480 1.8149 6.4066 11.6896 4.8550 50.4788 24.1808 6.6567 34.4179 37.6026 3.7147 207.1863 32.5214 93.3943 42.2020 60.7021 117.3104 1.1767 30.0796 42.8118 88.6198 54.2959 15.9816 41.3020 295.3264 67.2120 61.8722 104.2147 79.6086 57.3383 108.1828 390.3999 280.7278 818.5728 175.3865 526.7917 147.2870 220.6044 81.1643 11.8401 44.5317 11.5367 29.0795 9.4958 2.4288 5.3850 6.8390 19.3587 31.6856 28.2973 1.2529 69.2765 21.1928 37.8983 121.5364 199.2995 75.0658 51.6156
temp: 298.150 k
press: 1.00000 atm
elementType: 17 17 8 8 8 8 8 7 7 7 7 7 7 7 7 6 6 6 6 6 6 6 6 6 6 6 6 6 6 6 6 6 6 6 6 1 1 1 1 1 1 1 1 1 1 1 1 1 1 1 1 1 1 1 1
symmnumber: 1
zpe: 1050036.4 jmol-1
zpe.correction: 0.399938 hartree
zpe.thermalcorrener: 0.433979 hartree
zpe.thermalcorrenthalpy: 0.434923 hartree
zpe.thermalcorrgfe: 0.327320 hartree
zpe.sumelectzpe: -2505.899211 hartree
zpe.sumelectthermal: -2505.865170 hartree
zpe.sumelectthermalent: -2505.864226 hartree
zpe.sumelectthermalfe: -2505.971828 hartree
dipole: -3.1328 1.6274 2.0741
dipole: 4.0945
quadrupole: -232.0830 -180.1546 -220.1944
quadrupole: 12.6922 30.7985 3.6852
quadrupole: -21.2723 30.6561 -9.3838 12.6922 30.7985 3.6852
hfenergy: -2506.2991484 hartree
pointgroup: C01 [X(C20H20Cl2N8O5)]
dipole: -1.2172174 0.7199578 0.7713518 debye
polarizability: 392.8007642|-11.8194981|381.213411|-26.747565|-2.1911626|221.0184409 unknown
InChI: InChI=1S/C20H20Cl2N8O5/c1-30(7-8-6-25-17-15(26-8)16(23)28-20(24)29-17)9-4-10(21)14(11(22)5-9)18(33)27-12(19(34)35)2-3-13(31)32/h4-6,12,27,31,34H,2-3,7,23-24H2,1H3
charge 0 multiplicity 1
55 atoms
Cl 1.151064 0.435118 -1.831379
Cl 2.489162 -4.065006 1.217467
O  6.547928 0.591766 2.395301
O  3.966281 -1.867478 -1.314276
O  4.311022 0.478141 3.010511
O  3.957397 4.270263 -1.24272
O  5.812334 3.145848 -2.06944
N  -2.384908 -3.13104 -0.413598
N  3.601085 -0.649812 0.630221
N  -3.424033 -0.000717 -0.824087
N  -5.812335 -0.237428 0.750837
N  -5.774154 2.104487 1.152258
N  -3.948686 3.492823 0.213907
N  -2.222075 2.533197 -1.057235
N  -5.671816 4.410169 1.485712
C  4.993568 -0.193783 0.730009
C  5.362797 0.892535 -0.327246
C  -1.052337 -2.714526 -0.377293
C  4.46527 2.139564 -0.245457
C  -3.382242 -2.439657 -1.264498
C  1.724644 -1.868891 -0.330518
C  3.189024 -1.476833 -0.393195
C  -0.634245 -1.512967 -1.032383
C  -0.060473 -3.475644 0.31906
C  0.710801 -1.140066 -0.992623
C  1.272591 -3.041591 0.317539
C  5.208259 0.310185 2.152519
C  -4.017734 -1.207597 -0.629015
C  -2.811924 -4.292933 0.381036
C  4.847909 3.182609 -1.275578
C  -5.212755 -1.29235 0.161889
C  -3.997039 1.084721 -0.222411
C  -5.203576 1.0024 0.572241
C  -3.384616 2.405354 -0.356739
C  -5.120502 3.283878 0.93217
H  5.668735 -1.053817 0.553781
H  5.269804 0.422818 -1.320828
H  6.422867 1.167553 -0.191668
H  2.966433 -0.406523 1.397906
H  3.402971 1.873942 -0.403016
H  4.514049 2.624328 0.750156
H  -4.173421 -3.170358 -1.509132
H  -2.908501 -2.144309 -2.218262
H  -1.365933 -0.855244 -1.502545
H  -0.315483 -4.3979 0.842942
H  -3.902816 -4.415006 0.293039
H  -2.5743 -4.162072 1.454508
H  -2.334209 -5.230582 0.030822
H  -5.701731 -2.264607 0.306554
H  6.660191 0.925825 3.32634
H  4.241408 4.940022 -1.922948
H  -1.780686 3.447579 -1.130906
H  -1.781056 1.705016 -1.456547
H  -5.212873 5.307261 1.35205
H  -6.527934 4.320834 2.027371
