program: Gaussian 09
title: 000286607
version: EM64L-G09RevD.01
frameworkgroup: C1[X(C9H17N)]
method: RPBEPBE
basis: SDD
operation: Freq
keyword: #pfreq=noraman
keyword: PBEPBE/SDD
title: #p freq=noraman PBEPBE/SDD
converged: YES YES NO NO
title: Mulliken charges:
elementType: N C C C C C C C C C H H H H H H H H H H H H H H H H H
charge: -0.146608 0.011376 -0.481378 -0.400475 -0.362967 -0.456943 -0.377608 -0.411457 -0.419476 -0.350169 0.190980 0.222232 0.214069 0.205028 0.179752 0.210945 0.195201 0.222832 0.207232 0.178083 0.203806 0.198518 0.185805 0.193736 0.203299 0.182737 0.201450
chargesum: 0.00000
title: Mulliken charges with hydrogens summed into heavy atoms:
elementType: N C C C C C C C C C
charge: -0.146608 0.202356 -0.045077 -0.015694 0.043179 -0.026880 0.004281 -0.027134 -0.022441 0.034018
polarizability: 1.11820225e+02 -3.24372846e-01 1.01550198e+02 -1.27581278e+00 4.25615900e-01 8.25271228e+01
1716.lowfreq: -15.3246 -8.4373 -0.0006 -0.0006 -0.0004 22.6390 61.8262 99.1160 152.1036
frequency: 61.2730 99.0763 152.0917 209.3780 234.9681 285.9692 310.8099 355.1207 425.5033 448.5341 485.8197 562.4196 601.5631 705.9429 786.8843 808.7894 842.5326 857.3784 880.9589 891.9319 923.6191 949.2863 954.3505 977.0760 1011.1107 1037.2694 1054.2839 1092.5163 1103.0738 1119.1663 1135.2463 1148.3237 1170.0618 1175.7811 1212.9064 1220.0190 1233.8690 1239.2366 1258.5884 1276.6460 1283.2986 1304.8840 1316.2039 1318.5936 1331.9278 1338.8308 1348.0813 1352.6434 1358.4413 1386.3233 1442.3240 1460.5832 1462.3594 1464.1608 1471.2116 1476.3916 1485.0247 1506.1623 2813.7787 2853.7824 2931.1151 2949.1530 2951.4995 2960.7243 2966.4746 2971.2436 2977.7981 2992.8405 2999.5049 3008.5293 3025.8371 3029.2569 3037.4848 3061.1482 3073.7419
redmass: 2.3157 2.3671 2.2090 2.0502 2.0110 2.5620 2.7035 2.3732 3.6294 2.1615 1.7340 1.8794 2.8213 2.6399 1.9327 1.6785 1.6538 1.8207 1.4234 2.6042 2.5218 1.9145 1.6349 2.0289 1.7569 2.1689 1.6518 2.0047 2.1659 1.8024 1.8034 1.8905 1.5025 1.4224 1.4392 1.8422 1.2996 1.4740 1.3442 1.2213 1.2816 1.2982 1.2633 1.3810 1.3810 1.3899 1.4318 1.5266 1.4708 1.4247 1.0903 1.0852 1.0863 1.0917 1.0991 1.0805 1.0852 1.0881 1.0722 1.0819 1.0590 1.0602 1.0848 1.0628 1.1019 1.0618 1.0643 1.0622 1.0657 1.0971 1.1013 1.0988 1.1016 1.0995 1.1044
irintensity: 1.2692 0.3013 1.7758 1.5002 3.9333 0.4536 0.1717 0.1213 1.8253 1.0137 0.8955 1.2459 2.1273 2.8577 3.1804 3.6103 0.3387 2.7175 5.2226 1.6218 2.6378 1.0959 4.6593 6.8930 1.3157 6.3293 7.3502 0.6795 34.9766 1.4576 2.1234 15.4466 1.2616 15.4758 9.9048 14.9881 4.0164 12.6644 6.0253 1.5041 5.1469 5.5042 2.6984 0.7401 17.5302 2.8641 0.5272 2.1946 0.8771 3.1802 4.0900 10.4349 3.4958 13.3152 6.3408 18.7197 2.0040 1.5231 133.4370 73.8548 89.7814 27.0212 68.9875 39.6600 45.1041 36.0271 31.9732 41.8761 55.2970 63.8857 11.3640 77.5173 101.3162 35.5786 72.4623
temp: 298.150 k
press: 1.00000 atm
elementType: 7 6 6 6 6 6 6 6 6 6 1 1 1 1 1 1 1 1 1 1 1 1 1 1 1 1 1
symmnumber: 1
zpe: 646047.7 jmol-1
zpe.correction: 0.246067 hartree
zpe.thermalcorrener: 0.255637 hartree
zpe.thermalcorrenthalpy: 0.256581 hartree
zpe.thermalcorrgfe: 0.211462 hartree
zpe.sumelectzpe: -407.072996 hartree
zpe.sumelectthermal: -407.063425 hartree
zpe.sumelectthermalent: -407.062481 hartree
zpe.sumelectthermalfe: -407.107600 hartree
dipole: 0.3250 -0.0672 0.7116
dipole: 0.7851
quadrupole: -61.5868 -62.3212 -63.5438
quadrupole: 0.3665 -0.0979 -0.0339
quadrupole: 0.8971 0.1627 -1.0598 0.3665 -0.0979 -0.0339
hfenergy: -407.3190623 hartree
pointgroup: C01 [X(C9H17N1)]
dipole: -0.1314596 -0.0305777 -0.2778553 debye
polarizability: 111.7385522|0.6573864|101.5833909|-1.7364966|-0.4716457|82.5756028 unknown
InChI: InChI=1S/C9H17N/c1-2-5-9-6-4-8-10(9)7-3-1/h9H,1-8H2
charge 0 multiplicity 1
27 atoms
N  -0.463992 -0.640767 0.312264
C  -0.462834 0.685103 -0.370597
C  -1.916766 1.190968 -0.172994
C  0.567372 1.662236 0.248575
C  -1.85587 -1.113675 0.555516
C  -2.769036 -0.098418 -0.180259
C  0.48485 -1.691031 -0.100797
C  2.052312 1.348219 -0.042934
C  1.863737 -1.174518 -0.571079
C  2.505149 -0.086243 0.327577
H  -0.259886 0.584235 -1.466568
H  -2.209697 1.913785 -0.954289
H  -1.99701 1.696952 0.808686
H  0.395079 1.653212 1.343252
H  0.345294 2.688917 -0.112847
H  -2.087755 -1.139408 1.641248
H  -1.999309 -2.144665 0.165522
H  -3.750455 0.028267 0.309764
H  -2.947516 -0.429413 -1.220898
H  0.059889 -2.328477 -0.92198
H  0.637913 -2.370049 0.764972
H  2.678796 2.08183 0.504293
H  2.257423 1.509131 -1.122842
H  1.786405 -0.777733 -1.603386
H  2.530687 -2.057163 -0.632999
H  3.607486 -0.138727 0.223417
H  2.271629 -0.293866 1.390687
