program: Gaussian 09
title: 000027390
version: EM64L-G09RevD.01
frameworkgroup: C1[X(C15H20N2O2)]
method: RPBEPBE
basis: SDD
operation: Freq
keyword: #p
keyword: freq=noraman
keyword: PBEPBE/SDD
title: #p freq=noraman PBEPBE/SDD
converged: YES YES NO NO
title: Mulliken charges:
elementType: O O N N C C C C C C C C C C C C C C C H H H H H H H H H H H H H H H H H H H H
charge: -0.195956 -0.237724 -0.284173 -0.429190 -0.048254 -0.427594 -0.472291 -0.178427 -0.138927 0.142101 -0.736285 -0.725952 0.182031 0.283513 -0.358627 -0.366943 -0.219451 -0.234114 -0.227080 0.195676 0.252554 0.207640 0.195898 0.237921 0.247773 0.226884 0.226643 0.240796 0.209585 0.226960 0.204469 0.239949 0.277154 0.292826 0.273858 0.221175 0.233225 0.229267 0.233090
chargesum: 0.00000
title: Mulliken charges with hydrogens summed into heavy atoms:
elementType: O O N N C C C C C C C C C C C C C C C
charge: -0.195956 -0.237724 -0.007019 -0.136364 0.147423 0.032600 -0.038472 0.069346 0.087957 0.142101 -0.059261 -0.054575 0.182031 0.283513 -0.084769 -0.145768 0.013774 -0.004846 0.006010
polarizability: 2.42095838e+02 -1.73576406e+01 1.55519247e+02 -6.08976385e+00 -1.72676315e+01 1.36735659e+02
1716.lowfreq: -11.0316 0.0006 0.0009 0.0011 3.9790 7.3765 22.0041 24.3385 26.4254
frequency: 21.8426 24.0612 25.9788 52.7900 60.2254 114.4413 117.5927 135.0518 159.7437 176.2414 191.6082 207.0805 219.1839 255.1372 279.6640 306.2316 324.6632 341.9116 378.5836 386.4406 403.4801 405.0186 427.0283 467.3008 503.5274 530.1288 569.8092 586.9711 614.8418 640.0655 673.4866 690.3191 700.0227 707.6142 723.1651 792.5593 851.5304 855.7275 857.9806 867.8366 889.2500 907.6882 934.2434 963.0760 967.1798 983.8221 989.1518 1004.8062 1007.1533 1014.8943 1029.0281 1050.8038 1062.3835 1084.7887 1098.9161 1117.3304 1125.1272 1136.0409 1166.2563 1173.9244 1187.4875 1200.5417 1204.1054 1251.2009 1256.1799 1260.5258 1268.7342 1292.6857 1304.3293 1316.1528 1324.3027 1331.1476 1343.2729 1363.6071 1383.2423 1383.9308 1392.1981 1431.3432 1440.3647 1458.8340 1464.2472 1471.7942 1474.5092 1477.0164 1478.2980 1481.6268 1514.9998 1583.2201 1609.6627 1621.3054 1626.8407 2846.1317 2936.2261 2969.2677 2980.6070 2990.7963 2993.0633 3021.5085 3034.6738 3055.8299 3076.9743 3082.0750 3084.3033 3100.3196 3116.0663 3131.7110 3144.1894 3157.2799 3169.1643 3410.5575 3446.5244
redmass: 4.3988 4.9251 4.9308 6.2323 5.9046 3.0153 2.8227 3.8249 1.1784 3.1595 1.7572 1.4046 4.1282 4.1068 3.2469 3.6455 2.9661 2.6719 4.5994 2.6792 2.8706 2.4104 4.8056 2.4012 4.0186 3.3426 1.2248 3.2211 6.0844 3.4328 5.7302 4.2247 2.6470 1.7672 2.9648 2.3847 2.6645 1.4870 1.5871 3.6527 2.0752 1.9854 1.4422 1.6177 1.4977 1.4080 5.6273 1.3443 3.0788 1.6348 2.1212 2.1191 1.7256 1.6295 2.1810 2.2574 2.1294 2.2806 2.1979 1.0592 1.1943 2.0915 3.5513 1.3693 2.0319 1.5640 1.4326 1.3660 1.3425 1.3328 1.2942 1.4854 1.7901 1.4541 9.2092 1.2007 1.2081 1.9192 1.4299 1.0803 1.0473 1.0594 1.0544 2.0699 1.0839 1.0572 1.5076 6.2238 6.0620 9.6163 8.0823 1.0808 1.0803 1.0606 1.0349 1.0366 1.0609 1.0848 1.1013 1.1022 1.0993 1.1001 1.1000 1.0990 1.0874 1.0869 1.0920 1.0956 1.1008 1.0761 1.0761
irintensity: 0.7747 0.0668 0.2432 2.9894 5.9198 0.7029 1.4309 2.5288 0.1654 1.7937 1.5516 0.8525 5.4802 1.5906 3.0186 5.7505 4.6971 18.0659 8.7581 22.6924 0.9879 29.1478 6.3483 5.8146 4.7884 5.0094 79.6522 32.5617 1.3416 9.9090 12.7210 2.7876 12.3771 87.0311 2.4520 23.5120 9.5049 3.4885 8.2272 21.4941 1.1713 10.0243 3.7881 4.4518 23.8108 1.9167 0.0618 0.2661 31.5389 1.4280 6.3943 33.6860 2.4417 9.2475 9.6172 4.2155 6.1065 0.9328 8.9581 1.0430 17.2211 10.2963 33.4242 0.0435 98.1755 31.4644 30.9851 2.3133 0.4851 0.4851 3.1736 8.6569 1.7126 13.7995 0.6997 12.4876 20.5771 4.2476 47.5096 9.4780 6.5972 3.5027 18.9239 6.2225 6.0754 17.9648 79.6374 25.5912 6.1783 140.6942 142.5287 74.6869 19.1172 42.8038 25.2124 38.5267 21.2894 12.9750 18.9977 22.5630 34.9689 28.7617 37.5170 23.4841 14.7187 1.9802 22.8951 16.1842 21.5651 36.0228 0.6327
temp: 298.150 k
press: 1.00000 atm
elementType: 8 8 7 7 6 6 6 6 6 6 6 6 6 6 6 6 6 6 6 1 1 1 1 1 1 1 1 1 1 1 1 1 1 1 1 1 1 1 1
symmnumber: 1
zpe: 851129.4 jmol-1
zpe.correction: 0.324178 hartree
zpe.thermalcorrener: 0.343080 hartree
zpe.thermalcorrenthalpy: 0.344025 hartree
zpe.thermalcorrgfe: 0.274888 hartree
zpe.sumelectzpe: -842.099006 hartree
zpe.sumelectthermal: -842.080104 hartree
zpe.sumelectthermalent: -842.079160 hartree
zpe.sumelectthermalfe: -842.148296 hartree
dipole: -2.5454 1.6585 -5.8767
dipole: 6.6155
quadrupole: -116.9400 -112.1182 -115.7238
quadrupole: -9.8518 -8.5372 1.6604
quadrupole: -2.0127 2.8091 -0.7965 -9.8518 -8.5372 1.6604
hfenergy: -842.4231841 hartree
pointgroup: C01 [X(C15H20N2O2)]
dipole: -0.9970588 0.6123653 -2.3249117 debye
polarizability: 241.9636552|-17.8058395|154.9966052|-5.7416901|-17.6043532|137.3904838 unknown
InChI: InChI=1S/C15H20N2O2/c1-10-8-13(9-11(2)14(10)18)16-17-15(19)12-6-4-3-5-7-12/h3-7,10-11,13,16-17H,8-9H2,1-2H3
charge 0 multiplicity 1
39 atoms
O  5.006162 0.848097 1.307555
O  -1.589155 -1.62466 1.383385
N  0.422372 -1.439773 -0.621073
N  -0.8698 -0.898821 -0.731262
C  1.544916 -0.471784 -0.63297
C  1.485539 0.431354 0.618799
C  2.864535 -1.27249 -0.645287
C  2.698496 1.396875 0.723026
C  4.110832 -0.341306 -0.64145
C  4.027683 0.645547 0.539892
C  2.620102 2.580679 -0.285935
C  5.432295 -1.130355 -0.651909
C  -1.797881 -0.984028 0.316315
C  -3.101464 -0.262676 0.052567
C  -4.253627 -0.734709 0.731824
C  -3.212288 0.8729 -0.793329
C  -5.50056 -0.102403 0.54859
C  -4.460932 1.509561 -0.97173
C  -5.609029 1.019133 -0.308109
H  1.51489 0.170439 -1.550898
H  1.445945 -0.233563 1.502156
H  0.549355 1.021687 0.621663
H  2.913571 -1.927096 -1.539882
H  2.885717 -1.932083 0.244427
H  2.72585 1.82849 1.741057
H  4.056948 0.281385 -1.563348
H  1.697662 3.162226 -0.104747
H  3.481754 3.26037 -0.160539
H  2.603199 2.239389 -1.336805
H  5.514734 -1.765453 0.247902
H  5.490483 -1.778755 -1.545289
H  6.29982 -0.449606 -0.649424
H  0.557983 -2.267973 -1.214296
H  -1.154305 -0.439052 -1.606308
H  -4.141676 -1.590719 1.405335
H  -2.326268 1.295755 -1.283029
H  -6.385387 -0.478125 1.073865
H  -4.535885 2.392134 -1.616571
H  -6.576787 1.513509 -0.447768
