program: Gaussian 09
title: 000286622
version: EM64L-G09RevD.01
frameworkgroup: C1[X(C10H14N6O4)]
method: RPBEPBE
basis: SDD
operation: Freq
keyword: #p
keyword: freq=noraman
keyword: PBEPBE/SDD
title: #p freq=noraman PBEPBE/SDD
converged: YES YES NO NO
title: Mulliken charges:
elementType: O O O O N N N N N N C C C C C C C C C C H H H H H H H H H H H H H H
charge: -0.441632 -0.513463 -0.441397 -0.236972 -0.120621 -0.332068 0.061417 -0.141676 -0.071891 -0.583089 -0.208659 -0.080815 -0.472905 -0.163277 -0.131834 -0.440528 0.204533 -0.170040 0.038264 0.019278 0.287271 0.251537 0.237624 0.259084 0.277984 0.293948 0.243383 0.216908 0.356766 0.381812 0.417742 0.345512 0.320538 0.337264
chargesum: 0.00000
title: Mulliken charges with hydrogens summed into heavy atoms:
elementType: O O O O N N N N N N C C C C C C C C C C
charge: -0.084866 -0.131651 -0.095886 -0.236972 -0.120621 0.085674 0.061417 -0.141676 -0.071891 0.074713 0.078613 0.170722 0.023804 0.114707 0.162114 0.019764 0.204533 -0.170040 0.038264 0.019278
polarizability: 2.35390734e+02 -9.85403896e+00 1.79265858e+02 8.44927904e+00 -3.90082467e+00 1.01380498e+02
1716.lowfreq: -13.3385 -0.0007 -0.0004 0.0002 2.0543 10.1698 18.7232 30.8979 45.6558
frequency: 17.4510 30.6302 45.4924 100.5401 104.5651 113.2582 146.7630 162.8630 184.5185 202.3085 222.1067 251.9017 266.1280 278.6215 298.2705 307.6502 328.3474 341.6236 367.0154 387.9313 402.6348 416.2195 443.5700 458.7199 465.2149 512.1248 545.1850 552.7285 560.9872 620.0963 640.8766 648.7517 666.7331 701.6797 717.3660 772.6030 784.8128 805.4466 838.6770 865.5929 892.9641 913.3835 934.1851 949.5901 956.3368 970.7508 985.5747 995.6699 1010.3621 1032.0200 1061.6511 1076.2203 1091.7305 1110.0114 1151.0912 1156.0758 1160.9941 1177.7839 1189.8448 1195.7575 1232.1937 1257.5290 1271.7977 1280.7702 1295.6177 1308.3982 1326.6591 1331.3218 1343.8572 1353.2445 1363.5026 1367.5942 1384.5242 1400.9307 1407.6311 1456.2907 1471.2110 1482.7059 1552.4182 1566.3084 1593.3280 1618.1899 2983.9493 2991.1572 3020.1721 3020.7039 3031.5405 3043.9216 3073.5203 3078.2746 3095.2134 3553.9222 3571.8611 3575.9445 3610.0523 3717.3264
redmass: 5.5980 6.1316 6.6860 7.1419 7.5859 4.7863 3.8817 5.7374 7.8273 6.0504 3.0951 1.2256 3.7696 4.6963 6.1708 1.3599 4.4423 4.6279 2.9651 3.3518 1.2244 3.4312 3.8276 1.2085 8.6066 4.8651 8.8498 6.9363 1.1008 4.6669 5.1982 6.1237 9.5272 4.3966 11.2977 5.3389 10.8896 8.5668 2.5005 1.2319 1.9760 2.5186 2.3955 7.6026 3.7131 3.7752 2.8502 2.6664 3.5807 4.9596 1.4967 1.7749 3.0587 2.6736 1.9459 2.4588 1.7689 1.2069 1.3537 3.0914 1.7093 4.8495 1.3230 1.3463 1.3197 1.2763 1.3140 1.2797 3.6435 1.7306 1.5917 1.4385 3.1589 2.6719 2.5072 1.0890 1.0794 3.3391 1.6084 3.4999 2.3515 3.7219 1.0653 1.0832 1.0856 1.0647 1.1044 1.0862 1.0901 1.0998 1.1031 1.0438 1.0666 1.0667 1.0666 1.1060
irintensity: 1.4357 1.3120 6.3159 6.9383 2.6561 8.2009 10.3385 5.1896 0.2519 1.9829 27.2907 137.8411 54.7623 7.4943 24.6769 110.8059 8.6483 8.1630 2.9007 19.8522 163.9300 20.6388 2.0331 268.9955 1.9477 11.6601 6.0417 14.5461 31.6667 11.7888 3.4109 2.0467 0.4189 4.0984 6.9323 5.3836 25.7088 1.1313 32.0657 141.0968 42.3124 6.3158 10.1508 34.0191 61.9611 80.2113 59.6708 1.8567 62.1329 22.8476 22.9135 0.9636 52.1543 23.8886 14.9671 35.8941 7.2537 47.1323 13.1942 101.0342 11.4833 126.6219 13.0604 16.7785 6.8704 12.8139 11.0234 19.2317 78.5958 72.7880 27.1790 79.0468 93.3671 135.6617 63.2776 10.7359 11.2043 333.4773 211.2332 171.2985 824.6788 41.7900 43.6418 10.7903 36.0843 13.0186 1671.4023 32.1156 1.6490 18.5790 22.7548 124.5913 16.7180 11.3716 35.7579 44.2334
temp: 298.150 k
press: 1.00000 atm
elementType: 8 8 8 8 7 7 7 7 7 7 6 6 6 6 6 6 6 6 6 6 1 1 1 1 1 1 1 1 1 1 1 1 1 1
symmnumber: 1
zpe: 679620.0 jmol-1
zpe.correction: 0.258854 hartree
zpe.thermalcorrener: 0.277200 hartree
zpe.thermalcorrenthalpy: 0.278144 hartree
zpe.thermalcorrgfe: 0.211636 hartree
zpe.sumelectzpe: -1017.304058 hartree
zpe.sumelectthermal: -1017.285712 hartree
zpe.sumelectthermalent: -1017.284768 hartree
zpe.sumelectthermalfe: -1017.351276 hartree
dipole: 10.2283 5.6036 -0.6978
dipole: 11.6836
quadrupole: -150.4690 -113.6028 -108.1108
quadrupole: -35.1327 -7.0501 2.9651
quadrupole: -26.4082 10.4581 15.9501 -35.1327 -7.0501 2.9651
hfenergy: -1017.5629118 hartree
pointgroup: C01 [X(C10H14N6O4)]
dipole: 3.9826416 -1.7809021 1.447869 debye
polarizability: 235.3262164|0.55791|150.5312679|-14.3699616|-37.363311|130.1796068 unknown
InChI: InChI=1S/C10H14N6O4/c11-10-12-8-5(9(20)13-10)14-15-16(8)4-1-3(2-17)6(18)7(4)19/h3-4,6-7,15,17-19H,1-2,11H2
charge 0 multiplicity 1
34 atoms
O  2.835059 -2.633086 -0.364747
O  2.716902 0.608074 -1.950078
O  5.359278 1.144086 0.463596
O  -3.990784 2.109788 -1.263361
N  -0.032881 -0.210221 -0.307028
N  0.186264 0.891203 -1.168355
N  -0.964957 1.535875 -1.468709
N  -2.038001 -1.056694 0.797003
N  -4.075206 0.258028 0.195749
N  -4.156827 -1.565904 1.640297
C  1.022496 -1.069103 0.250448
C  3.004956 0.385975 0.552432
C  1.892393 -0.376947 1.336182
C  2.072523 -1.468618 -0.829796
C  3.099254 -0.310207 -0.845059
C  4.367869 0.399907 1.265278
C  -1.389321 -0.211151 -0.011856
C  -1.94401 0.896751 -0.762456
C  -3.407898 1.164599 -0.654544
C  -3.414827 -0.734852 0.833234
H  0.473869 -1.941754 0.649489
H  2.684021 1.434794 0.390023
H  2.343117 -1.168321 1.962649
H  1.292471 0.278732 1.988075
H  1.622689 -1.638383 -1.827156
H  4.106312 -0.711643 -1.04406
H  4.770639 -0.624518 1.341018
H  4.279046 0.820555 2.287488
H  2.260005 -3.438889 -0.390982
H  3.463176 1.227863 -2.135135
H  1.115313 1.003869 -1.650639
H  5.271084 2.112344 0.649293
H  -3.699481 -2.322818 2.140744
H  -5.156343 -1.395538 1.715765
