program: Gaussian 09
title: 000286599
version: EM64L-G09RevD.01
frameworkgroup: C1[X(C7H13N)]
method: RPBEPBE
basis: SDD
operation: Freq
keyword: #pfreq=noraman
keyword: PBEPBE/SDD
title: #p freq=noraman PBEPBE/SDD
converged: YES YES NO NO
title: Mulliken charges:
elementType: N C C C C C C C H H H H H H H H H H H H H
charge: -0.384911 0.406961 -0.565822 -0.489708 -0.498682 -0.395715 -0.389111 -0.392371 0.218933 0.227759 0.217087 0.204042 0.205339 0.188656 0.245671 0.202151 0.201341 0.198844 0.202003 0.191932 0.205602
chargesum: 0.00000
title: Mulliken charges with hydrogens summed into heavy atoms:
elementType: N C C C C C C C
charge: -0.139240 0.406961 -0.119131 -0.068579 -0.104687 0.007776 0.011736 0.005162
polarizability: 8.65279233e+01 1.10919272e+00 7.53308081e+01 1.79982639e+00 -6.96882450e-01 7.08301572e+01
1716.lowfreq: -47.3800 -11.2710 -0.0008 -0.0006 -0.0002 22.1664 115.7499 186.9257 282.7562
frequency: 115.7228 186.9098 282.7557 300.4426 369.1987 373.0854 438.2645 442.1989 530.5072 662.7299 779.6497 788.8234 825.6154 851.2655 862.0853 872.5093 921.4325 936.9121 970.5156 986.2304 1015.8202 1043.4468 1083.3172 1093.6623 1111.9911 1124.5069 1141.5196 1189.3324 1222.6627 1248.9230 1255.7153 1295.4590 1324.4413 1328.0582 1330.9077 1338.6667 1352.1218 1386.8291 1459.3754 1461.9477 1463.5919 1467.3802 1476.3337 1483.5562 2958.5239 2968.0820 2972.5955 2973.5090 2976.0563 3015.7965 3030.9362 3034.9973 3043.9833 3055.5933 3064.4096 3168.5047 3322.2076
redmass: 2.9055 2.0177 1.9787 2.9243 2.1057 2.3338 2.2995 2.6679 2.1303 3.2554 2.5792 1.5493 3.2418 1.4665 2.7547 2.0375 1.5472 1.2605 1.2274 2.5734 1.4579 1.7097 1.2809 1.8021 1.5157 1.2160 1.4072 1.6355 1.3112 1.3204 1.2646 1.3836 1.3398 1.5161 1.5115 1.5947 1.9984 2.2624 1.0852 1.1086 1.0935 1.1094 1.1289 1.1185 1.0594 1.0622 1.0642 1.0638 1.0634 1.0997 1.0962 1.1007 1.1022 1.0993 1.0551 1.1157 1.0765
irintensity: 0.4409 0.8933 0.0108 10.4938 1.4999 0.7035 0.5024 3.4025 3.2354 13.0391 43.1669 6.3320 9.4994 4.4626 1.4156 10.2517 0.6807 10.1725 6.7708 4.4452 13.2923 3.9858 0.5701 0.0700 1.5321 29.7243 2.3812 1.5753 7.3573 0.9476 2.5845 2.9029 2.9309 1.4147 0.4919 0.9860 1.5613 2.3501 1.8368 5.8857 15.5004 22.7421 5.2491 2.5243 37.8837 32.2502 27.0644 37.6551 26.7461 51.2680 66.0240 38.3547 71.9781 54.2884 30.5988 19.3656 9.5427
temp: 298.150 k
press: 1.00000 atm
elementType: 7 6 6 6 6 6 6 6 1 1 1 1 1 1 1 1 1 1 1 1 1
symmnumber: 1
zpe: 495144.0 jmol-1
zpe.correction: 0.188590 hartree
zpe.thermalcorrener: 0.196072 hartree
zpe.thermalcorrenthalpy: 0.197016 hartree
zpe.thermalcorrgfe: 0.157280 hartree
zpe.sumelectzpe: -328.604369 hartree
zpe.sumelectthermal: -328.596887 hartree
zpe.sumelectthermalent: -328.595943 hartree
zpe.sumelectthermalfe: -328.635679 hartree
dipole: -1.3926 1.4975 0.6922
dipole: 2.1590
quadrupole: -54.6854 -49.0340 -49.7725
quadrupole: 4.4997 2.5047 -1.4866
quadrupole: -3.5214 2.1300 1.3914 4.4997 2.5047 -1.4866
hfenergy: -328.7929591 hartree
pointgroup: C01 [X(C7H13N1)]
dipole: 0.5585842 -0.5794232 0.2715499 debye
dipolederiv: -0.6284834 -0.0263806 -0.2178095 0.0533757 -0.1074461 0.0115868 -0.3081217 -0.0450546 -0.3498663 0.2279521 0.058516 0.0428759 0.1009969 0.2010963 -0.0286232 0.0499843 -0.0150865 0.2025601 0.0307551 -0.0246815 0.0888315 -0.049791 0.1233663 0.0905641 0.0727844 0.0549162 0.0134426 0.0076713 0.0034373 -0.0360935 0.0185716 0.0161629 -0.022029 0.0152465 -0.0102785 0.1363739 -0.0247838 0.0140681 -0.0511931 -0.005788 0.0433628 0.0187467 -0.0736926 0.039023 0.1457752 0.070869 0.0231118 -0.0292853 -0.0075992 0.0576737 -0.0058393 0.0077779 0.0151815 0.1301362 0.0717321 -0.0225084 -0.0182527 0.0105796 0.0559623 0.0096658 0.0178768 -0.0088127 0.13019 0.0700929 0.0029594 0.0011928 0.0112817 0.0392181 0.0014303 -0.0337938 -0.0030351 0.1544378 0.1073261 -0.0059251 -0.0311606 -0.0289694 -0.089055 0.1217669 0.0148802 0.066252 -0.0452058 0.1000998 0.0442282 0.0289709 0.041564 -0.0533603 -0.1112612 0.0208208 -0.065426 -0.0369151 -0.0258794 0.1227549 0.0146913 0.0896855 -0.0862441 -0.021079 0.0273031 -0.059651 0.0684925 0.0182216 -0.0362001 0.0522835 -0.0456145 0.0672809 -0.0162486 0.0379553 0.0390942 -0.180959 0.0166559 0.0280142 0.0456937 0.0418511 0.06276 0.0071286 0.0352987 -0.0482419 -0.1862164 -0.0723101 -0.1472448 0.0166823 -0.0984441 -0.1127547 0.0262271 0.0339413 0.0662575 0.056943 0.1934266 -0.0307527 0.0271672 -0.1367079 -0.0933722 -0.080524 0.0403295 -0.0221217 0.1515136 0.0379233 0.0399609 0.0495937 0.031129 0.065652 0.0135425 0.0106107 -0.039872 -0.1845743 -0.0505528 -0.123727 0.0186147 -0.1208593 -0.1531891 0.0317874 0.026302 0.0590418 0.0685256 -0.0635379 0.1194655 0.0152155 0.1246369 -0.1575697 -0.0304041 0.0236168 -0.0599075 0.0683788 0.0349493 -0.0388621 0.0500444 -0.0285472 0.0642216 -0.0149131 0.0126447 0.0382417 -0.1799203 0.0680931 0.0003493 0.0313633 0.0005835 0.0175188 -0.0022255 0.1079466 -0.0018531 -0.1832125 -0.190221 -0.0005834 -0.099426 -0.0019352 0.0387153 0.0007007 -0.1397115 0.0013326 0.0201005 unknown
polarizability: 86.4754615|1.2947229|75.373496|-1.8655775|0.6540004|70.8399311 unknown
InChI: InChI=1S/C7H13N/c1-2-4-7(5-3-1)6-8-7/h8H,1-6H2
charge 0 multiplicity 1
21 atoms
N  -2.279234 0.065764 -0.459742
C  -0.790851 -0.001175 -0.152856
C  -1.792708 -0.013823 0.987108
C  -0.009503 1.273437 -0.465497
C  -0.010489 -1.28517 -0.442766
C  1.34913 1.278423 0.279881
C  1.354541 -1.279363 0.295841
C  2.163318 -0.000889 -0.035306
H  -1.927969 -0.955001 1.537348
H  -1.965504 0.893433 1.575044
H  -0.616671 2.157329 -0.19879
H  0.16825 1.322796 -1.559564
H  0.167921 -1.362003 -1.536004
H  -0.604505 -2.173307 -0.145252
H  -2.636247 -0.86089 -0.770145
H  1.168577 1.334721 1.372951
H  1.929418 2.179167 0.001861
H  1.933519 -2.183044 0.023845
H  1.176277 -1.324328 1.389444
H  2.429015 -0.006272 -1.112914
H  3.114816 0.002495 0.530714
