program: Gaussian 09
title: 000027388
version: EM64L-G09RevD.01
frameworkgroup: C1[X(C12H18N4O2)]
method: RPBEPBE
basis: SDD
operation: Freq
keyword: #p
keyword: freq=noraman
keyword: PBEPBE/SDD
title: #p freq=noraman PBEPBE/SDD
converged: YES YES NO NO
title: Mulliken charges:
elementType: O O N N N N C C C C C C C C C C C C H H H H H H H H H H H H H H H H H H
charge: -0.277685 -0.230830 -0.373428 -0.237734 -0.404258 -0.003096 -0.535971 -0.361762 -0.358970 -0.341675 0.248761 -0.686673 0.189603 0.290895 -0.291552 -0.313166 -0.322646 -0.328059 0.222965 0.238093 0.257962 0.207945 0.235501 0.235281 0.203868 0.224042 0.302835 0.275883 0.207820 0.229269 0.208763 0.298423 0.271438 0.228725 0.245988 0.243442
chargesum: 0.00000
title: Mulliken charges with hydrogens summed into heavy atoms:
elementType: O O N N N N C C C C C C C C C C C C
charge: -0.277685 -0.230830 -0.070593 0.038150 -0.105835 -0.003096 -0.074913 0.104145 0.111813 0.086234 0.248761 -0.040821 0.189603 0.290895 -0.020113 -0.084442 -0.076658 -0.084617
polarizability: 2.22001956e+02 -1.23477167e+01 1.17127465e+02 1.07260570e+00 -8.47493205e+00 1.57042705e+02
1716.lowfreq: -6.6889 -2.7940 -0.0003 0.0004 0.0007 3.2518 9.6224 20.3273 31.6045
frequency: 9.1273 18.0379 30.7084 37.5205 40.5743 55.0290 82.2412 100.4909 104.6292 129.5102 143.7018 205.6364 215.5661 232.6015 254.4632 278.7464 311.1831 363.5548 365.3297 374.3591 406.9529 449.9043 467.6896 509.6110 566.0493 583.3372 598.2137 624.0656 660.0846 670.3785 693.9030 705.3629 754.6970 756.8246 807.3520 837.3156 851.3353 864.5416 867.1787 891.1898 936.5128 957.9480 966.6301 985.8236 986.5228 1005.3730 1049.5136 1061.7879 1069.2883 1084.4994 1092.7113 1095.3947 1114.6697 1135.6615 1169.8759 1205.6850 1221.3080 1228.8856 1249.1113 1261.9013 1277.5921 1280.0771 1300.1265 1308.0992 1324.4084 1342.7706 1358.7776 1365.9112 1390.8679 1398.7986 1431.4250 1447.1711 1452.2590 1461.0065 1462.9924 1479.2214 1483.8971 1493.1120 1494.4065 1519.3500 1547.5798 1580.4203 1616.3010 1627.4597 2931.3077 2972.0866 2978.0751 2987.8167 2990.0781 3040.6950 3042.0630 3063.6595 3069.1191 3074.6800 3078.2657 3125.6225 3140.3600 3149.1320 3173.2782 3404.7844 3426.8715 3559.1928
redmass: 4.5664 4.3915 4.7177 4.5354 5.2431 5.1580 2.2985 2.2835 2.7093 5.6163 3.0857 2.9968 3.6705 1.7525 3.8877 3.4035 2.9829 3.6351 2.5215 5.0604 3.6322 2.7915 2.1004 4.2178 1.7377 1.2789 1.4406 3.0778 6.6977 4.9999 3.7522 3.1775 2.4410 1.5629 1.3013 1.7343 2.1620 4.1576 2.4857 1.2590 2.0600 3.8987 1.6897 1.5629 2.0249 2.8667 2.2736 2.2484 2.5776 1.7623 2.5944 2.4504 2.2765 2.0020 1.7280 2.3482 1.4493 1.5772 1.2153 2.5601 1.1616 1.2270 6.5890 1.4556 1.5085 1.4121 1.2725 1.4750 1.2302 1.8482 1.2404 1.0976 1.1230 1.8799 1.0758 1.0529 1.2250 1.1223 1.4822 1.4455 7.4250 5.5863 6.3103 8.5703 1.0685 1.0363 1.0629 1.0618 1.0650 1.0986 1.0917 1.0997 1.0999 1.0988 1.0999 1.0876 1.0896 1.0974 1.0966 1.0764 1.0756 1.0775
irintensity: 1.6577 1.8627 1.6007 6.3607 0.6282 5.7685 1.9273 4.4194 1.9297 10.1681 6.6580 5.1859 4.2804 1.7120 4.7036 7.6096 1.0604 21.5146 0.6577 2.8409 0.8229 30.1602 5.7123 6.8483 23.8863 186.6524 56.3556 10.9411 0.8813 29.2553 1.3872 21.3903 15.7771 15.5522 4.3221 34.3712 6.1787 20.1062 3.1979 3.4715 7.6976 1.7364 1.8994 2.3659 5.2007 1.1238 28.9872 7.2000 12.0869 4.7679 9.0649 10.0905 3.8382 3.3091 46.6421 18.7276 2.6748 37.1922 17.2888 119.3606 19.5874 12.0762 0.9265 68.9012 2.8160 1.5377 0.0598 18.1748 24.5031 13.4524 46.4164 17.6902 34.5076 2.7184 7.0561 13.5767 67.1525 3.9086 186.5491 79.3308 30.9874 6.8738 197.0007 121.4716 33.1970 30.4575 17.8019 29.8325 43.6865 4.5112 5.9135 38.2053 77.7628 31.5068 30.3671 8.3924 26.5010 17.5513 5.9421 43.5432 1.8608 15.9881
temp: 298.150 k
press: 1.00000 atm
elementType: 8 8 7 7 7 7 6 6 6 6 6 6 6 6 6 6 6 6 1 1 1 1 1 1 1 1 1 1 1 1 1 1 1 1 1 1
symmnumber: 1
zpe: 774278.3 jmol-1
zpe.correction: 0.294907 hartree
zpe.thermalcorrener: 0.313965 hartree
zpe.thermalcorrenthalpy: 0.314909 hartree
zpe.thermalcorrgfe: 0.242280 hartree
zpe.sumelectzpe: -836.141880 hartree
zpe.sumelectthermal: -836.122822 hartree
zpe.sumelectthermalent: -836.121878 hartree
zpe.sumelectthermalfe: -836.194508 hartree
dipole: 3.9141 -1.1514 0.0092
dipole: 4.0800
quadrupole: -108.8968 -104.1452 -115.7193
quadrupole: 9.4624 12.8748 -1.1554
quadrupole: 0.6903 5.4419 -6.1322 9.4624 12.8748 -1.1554
hfenergy: -836.4367873 hartree
pointgroup: C01 [X(C12H18N4O2)]
dipole: -1.5246906 0.0100828 0.501825 debye
polarizability: 221.1236475|0.1415675|157.2905408|-15.7667133|-7.644364|117.7579368 unknown
InChI: InChI=1S/C12H18N4O2/c1-2-6-14-11(17)5-9-15-16-12(18)10-3-7-13-8-4-10/h3-4,7-8,14-16H,2,5-6,9H2,1H3
charge 0 multiplicity 1
36 atoms
O  -3.701607 1.807752 1.101459
O  1.897054 -2.119961 0.446804
N  -4.74476 -0.234038 0.683571
N  0.016318 -0.324274 1.614987
N  1.269101 0.051807 1.094494
N  5.82244 0.695587 -1.221066
C  -2.441474 -0.248147 1.568592
C  -6.014177 0.35733 0.221814
C  -1.143475 0.356178 0.994838
C  -6.183707 0.331389 -1.316113
C  -3.670779 0.537379 1.094145
C  -6.246343 -1.091898 -1.911326
C  2.118979 -0.879064 0.491498
C  3.382644 -0.277474 -0.092336
C  4.525257 -1.10892 -0.191277
C  3.480358 1.046953 -0.591127
C  5.710522 -0.584429 -0.74922
C  4.708525 1.481783 -1.141227
H  -2.415571 -0.179608 2.675997
H  -2.497906 -1.320118 1.306834
H  -6.019186 1.400328 0.582831
H  -6.853605 -0.182912 0.702341
H  -1.16173 1.45679 1.163119
H  -1.092578 0.181163 -0.094432
H  -7.117012 0.876403 -1.560759
H  -5.352822 0.900302 -1.774336
H  -4.643114 -1.249864 0.672414
H  0.009429 -0.320565 2.644416
H  -7.070401 -1.678221 -1.461123
H  -6.4177 -1.057785 -3.002181
H  -5.301868 -1.644304 -1.746641
H  1.575465 1.03174 1.165131
H  4.465572 -2.144776 0.155384
H  2.622389 1.728658 -0.599195
H  6.61248 -1.200788 -0.830934
H  4.812082 2.496307 -1.542477
