program: Gaussian 09
title: 000027443
version: EM64L-G09RevD.01
frameworkgroup: C1[X(C21H23NO2)]
method: RPBEPBE
basis: SDD
operation: Freq
keyword: #p
keyword: freq=noraman
keyword: PBEPBE/SDD
title: #p freq=noraman PBEPBE/SDD
converged: YES YES NO NO
title: Mulliken charges:
elementType: O O N C C C C C C C C C C C C C C C C C C C C C H H H H H H H H H H H H H H H H H H H H H H H
charge: -0.279139 -0.246122 -0.123911 -0.505936 0.458416 0.186961 -0.318411 -0.307301 -0.501780 0.175549 -0.434865 0.035026 0.124597 -0.364221 0.139568 -0.681795 -0.676167 0.300323 -0.824182 -0.364713 -0.375232 -0.230857 -0.240421 -0.236220 0.225053 0.198802 0.185524 0.222430 0.180909 0.204047 0.314282 0.242635 0.258521 0.240922 0.204819 0.208366 0.234523 0.207381 0.208227 0.274207 0.233402 0.237667 0.256375 0.257463 0.230389 0.231738 0.233150
chargesum: 0.00000
title: Mulliken charges with hydrogens summed into heavy atoms:
elementType: O O N C C C C C C C C C C C C C C C C C C C C C
charge: -0.279139 -0.246122 -0.123911 -0.082082 0.458416 0.186961 0.089543 0.077656 -0.187498 0.175549 -0.192230 0.035026 0.124597 -0.105699 0.139568 -0.027688 -0.026036 0.300323 -0.078906 -0.108338 -0.117769 -0.000468 -0.008682 -0.003071
polarizability: 3.86217144e+02 -5.73846347e+00 2.41689476e+02 6.84162452e+00 -1.32004020e+01 1.48859357e+02
1716.lowfreq: -5.2159 -4.0266 -0.0008 0.0003 0.0005 5.4040 16.1701 26.2978 39.5774
frequency: 16.1296 26.2597 39.5190 45.9030 55.8946 74.0039 80.5996 85.3628 101.9780 130.3440 167.8590 176.8391 188.3240 190.2853 212.4113 238.0827 263.6205 265.6727 286.9855 295.2693 324.0122 339.4865 346.8053 363.0000 367.8870 406.6143 416.4981 440.2211 443.6134 476.0947 490.4775 506.9891 540.9540 569.5291 612.7628 620.7772 638.3001 656.6175 682.7501 698.8157 702.6689 750.7281 767.0950 781.6973 785.8379 797.5969 801.8943 808.6138 826.9268 856.1052 890.7731 904.5998 934.8873 948.2207 978.3979 982.6598 987.7785 991.1212 993.3287 1000.7708 1008.7380 1015.6039 1034.8900 1042.4779 1065.4107 1074.9499 1075.9979 1086.6268 1103.7612 1111.2351 1119.7927 1140.3432 1165.4796 1175.4571 1189.5600 1195.2095 1205.5159 1228.5325 1230.3250 1251.2046 1269.0906 1286.0790 1290.1570 1317.6256 1341.5758 1360.2699 1364.1402 1372.8885 1380.4420 1389.1470 1390.0302 1398.4114 1406.9355 1429.1138 1435.7865 1454.5708 1456.7515 1465.0008 1467.1160 1469.7710 1474.2568 1475.9025 1479.1200 1482.1264 1485.8066 1490.6937 1545.6838 1572.6331 1583.9984 1605.0000 1614.0592 1625.8503 2831.8492 2845.3643 2859.0196 2981.7699 2983.0318 2983.9315 3007.4666 3029.1516 3042.4359 3063.7885 3073.5413 3075.9571 3092.6440 3093.9235 3106.0835 3123.0758 3129.7787 3140.7827 3156.4823 3162.2253 3167.7380 3168.2403 3176.0074
redmass: 4.5383 3.5654 3.6256 3.7525 4.2498 4.0116 1.9521 4.0498 2.3418 3.7251 4.0551 2.9318 1.5567 1.3250 1.5069 3.0224 3.0305 2.9987 2.0956 3.0115 4.3166 3.0607 3.9266 3.6790 4.0594 2.8423 4.1014 3.7532 3.2352 3.6874 3.3821 6.6430 3.9514 5.7789 6.4083 5.0773 5.9180 6.3681 6.5850 4.1340 1.7896 2.6575 3.0044 2.3306 4.9906 1.1854 1.2364 4.7578 1.4634 1.2463 3.4725 2.0534 1.4211 1.4196 1.4610 1.4109 4.1549 4.2188 2.2548 1.3363 1.7059 2.3785 1.8469 1.5094 2.4891 2.1017 1.9191 2.1549 2.2193 2.0127 2.1160 1.7796 1.8480 1.0541 1.7847 1.2154 2.3381 3.5345 2.5843 1.6550 1.2694 1.4349 1.2658 1.5268 2.6319 1.7800 1.3668 1.4924 7.2792 1.2320 1.2329 1.2463 5.6188 3.2747 2.4300 1.0941 1.1989 1.0517 2.0022 1.0570 1.1182 1.2404 1.0804 2.0027 1.0622 1.0760 8.5667 6.4001 6.1715 7.4905 6.1885 7.3010 1.0723 1.0724 1.0712 1.0399 1.0361 1.0361 1.0838 1.0877 1.0872 1.0924 1.0985 1.0972 1.1003 1.1002 1.1005 1.0897 1.0852 1.0893 1.0941 1.0913 1.0952 1.0956 1.0991
irintensity: 0.4150 0.2239 0.3080 0.3864 0.1555 3.0588 0.2833 0.9965 0.3665 0.7489 0.5445 0.0582 1.0743 0.5328 0.1367 0.6989 4.0478 0.4076 0.7407 0.4086 0.3483 0.8583 13.1603 3.3116 2.9467 0.2633 0.5927 3.0386 4.8426 9.4365 1.7561 1.1135 11.5286 3.1165 0.4235 6.7499 10.1612 8.9027 8.7367 0.8471 55.3161 6.0453 37.4878 17.5870 6.7678 4.2740 9.9267 7.9521 46.0540 1.7399 3.8146 1.8847 3.7357 2.2997 4.9850 3.9188 5.7326 8.6284 16.2569 0.6558 15.4449 22.6908 0.9292 7.1269 24.5895 34.0791 37.2529 3.1757 19.6368 32.3070 57.8419 12.0214 15.6140 0.3892 30.5476 5.9111 30.6201 11.7518 24.9570 37.2449 22.4159 28.0606 20.4965 44.6587 174.6433 13.0489 9.6304 8.6587 8.6833 25.6795 21.1803 35.4762 4.0924 34.5170 35.5986 32.8831 11.1959 3.5591 70.4549 8.3006 1.6675 10.7144 7.1599 17.4603 9.7305 14.3701 185.3068 24.8184 7.0697 79.6512 14.4696 10.3383 42.6857 45.5773 252.0565 21.4834 32.5934 26.9297 15.3306 14.3098 10.5706 13.3728 28.2649 104.6427 39.2265 35.3220 7.1666 14.0019 0.4024 9.8508 30.1750 0.5375 4.1327 20.8765 10.9650
temp: 298.150 k
press: 1.00000 atm
elementType: 8 8 7 6 6 6 6 6 6 6 6 6 6 6 6 6 6 6 6 6 6 6 6 6 1 1 1 1 1 1 1 1 1 1 1 1 1 1 1 1 1 1 1 1 1 1 1
symmnumber: 1
zpe: 1013061.7 jmol-1
zpe.correction: 0.385855 hartree
zpe.thermalcorrener: 0.408711 hartree
zpe.thermalcorrenthalpy: 0.409655 hartree
zpe.thermalcorrgfe: 0.331902 hartree
zpe.sumelectzpe: -1017.487856 hartree
zpe.sumelectthermal: -1017.465000 hartree
zpe.sumelectthermalent: -1017.464055 hartree
zpe.sumelectthermalfe: -1017.541808 hartree
dipole: 0.9800 -3.4774 0.3005
dipole: 3.6254
quadrupole: -108.9620 -142.3931 -142.9784
quadrupole: 7.1311 -0.3359 -3.0917
quadrupole: 22.4825 -10.9486 -11.5339 7.1311 -0.3359 -3.0917
hfenergy: -1017.8737104 hartree
pointgroup: C01[X(C21H23N1O2)]
dipole: 0.3949494 -1.3126567 0.3941519 debye
polarizability: 386.460375|-4.8307237|232.168192|2.7451126|-30.9975488|158.137411 unknown
InChI: InChI=1S/C21H23NO2/c1-4-22(5-2)14-16-11-12-19-18(13-16)20(23)15(3)21(24-19)17-9-7-6-8-10-17/h6-13H,4-5,14H2,1-3H3
charge 0 multiplicity 1
47 atoms
O  1.60194 -1.014574 0.126731
O  -0.504956 2.502395 -0.613005
N  -4.852099 -0.104915 0.302233
C  -4.134896 -1.33786 -0.089144
C  -2.615332 -1.212104 0.004672
C  -0.557271 0.124045 -0.181428
C  -4.807934 0.12865 1.772506
C  -6.223607 -0.032184 -0.266833
C  -1.97155 0.018777 -0.219582
C  0.199384 -1.043444 0.085487
C  -1.820472 -2.363858 0.278039
C  0.136205 1.417797 -0.397169
C  1.618435 1.389158 -0.331137
C  -0.417299 -2.291603 0.316053
C  2.290426 0.197513 -0.10015
C  -5.021693 1.604383 2.157808
C  -6.236918 0.302085 -1.771053
C  3.752636 -0.035704 -0.016762
C  2.308909 2.727414 -0.481385
C  4.257876 -1.004495 0.895467
C  4.669248 0.659378 -0.852306
C  5.642863 -1.249609 0.987692
C  6.054474 0.407378 -0.761177
C  6.548601 -0.542096 0.162605
H  -4.400236 -1.56341 -1.140237
H  -4.464242 -2.227392 0.508954
H  -5.549417 -0.518945 2.307352
H  -3.806527 -0.18135 2.123798
H  -6.792456 -0.980064 -0.082671
H  -6.765745 0.765041 0.271812
H  -2.563028 0.918272 -0.416235
H  -2.313775 -3.325838 0.464288
H  0.202398 -3.169359 0.520831
H  -4.260172 2.2370 1.669906
H  -6.018326 1.977161 1.859109
H  -4.935309 1.729237 3.253246
H  -5.71141 1.255709 -1.951156
H  -5.74331 -0.478238 -2.378774
H  -7.277377 0.395424 -2.134462
H  1.631021 3.511126 -0.103001
H  2.496263 2.972171 -1.544572
H  3.267958 2.770119 0.059634
H  3.556557 -1.557623 1.527185
H  4.298315 1.370832 -1.595097
H  6.016413 -1.991865 1.701593
H  6.746172 0.945525 -1.418371
H  7.624864 -0.734261 0.233205
