program: Gaussian 09
title: 000294110
version: EM64L-G09RevD.01
frameworkgroup: C1[X(C9H14N2O)]
method: RPBEPBE
basis: SDD
operation: Freq
keyword: #p
keyword: freq=noraman
keyword: PBEPBE/SDD
title: #p freq=noraman PBEPBE/SDD
converged: YES YES NO NO
title: Mulliken charges:
elementType: O N N C C C C C C C C C H H H H H H H H H H H H H H
charge: -0.267979 -0.387472 -0.150966 -0.047062 -0.428700 -0.470302 -0.391019 -0.412102 -0.377347 0.226708 -0.163473 -0.283315 0.248511 0.254972 0.190706 0.208109 0.217291 0.204450 0.202251 0.208336 0.187325 0.192544 0.201925 0.320842 0.260676 0.255092
chargesum: 0.00000
title: Mulliken charges with hydrogens summed into heavy atoms:
elementType: O N N C C C C C C C C C
charge: -0.267979 -0.066630 -0.150966 0.201449 0.016977 -0.044901 0.015682 -0.016441 0.017122 0.226708 0.097203 -0.028223
polarizability: 1.42933480e+02 5.41102367e+00 9.39895360e+01 -6.24600393e+00 7.68834342e+00 8.70231184e+01
1716.lowfreq: -17.5884 -0.0003 0.0002 0.0007 5.7418 21.3917 38.0096 58.5396 100.0509
frequency: 35.6451 58.1953 99.8895 153.2888 196.0156 250.1189 283.4539 346.2657 359.3796 362.4291 438.8167 460.2677 491.9455 577.6348 631.2787 664.5237 696.5028 755.1594 775.3871 793.5299 832.9309 841.1025 858.9512 861.7822 880.0690 893.9451 929.1662 986.4471 996.3497 1008.5042 1040.8392 1055.3328 1070.3489 1088.7066 1110.0054 1115.4388 1149.3467 1166.2472 1198.4604 1245.7202 1257.5122 1273.6825 1276.1943 1305.8847 1330.3354 1331.8288 1335.3177 1350.7656 1358.5490 1366.9299 1454.1905 1461.2904 1464.6924 1467.6064 1474.6316 1485.8778 1502.8705 1638.3021 2958.6867 2965.3937 2975.6555 2977.3421 2980.6194 3002.5584 3026.8518 3030.2496 3039.3090 3045.3048 3057.5812 3238.3681 3290.3835 3590.7562
redmass: 4.0934 5.1053 3.5213 4.0894 2.6867 2.8467 3.4915 1.2801 2.8638 1.5072 3.2419 2.5998 2.2617 3.4462 2.5021 1.6785 3.1265 4.9038 1.5590 3.3033 1.9452 1.3302 2.5691 2.3299 3.8788 3.9910 1.4417 4.9625 2.8695 2.6447 1.5740 1.7726 1.9595 1.7039 1.3940 1.0414 2.0922 1.9874 3.1102 1.3303 1.2739 1.3220 1.4391 1.7289 1.3777 1.4344 1.4376 1.4307 1.4739 1.3472 1.2605 1.1966 1.0998 1.1563 1.0843 1.1406 4.4730 11.2195 1.0667 1.0619 1.0660 1.0635 1.0634 1.0828 1.0945 1.0972 1.1016 1.1012 1.0987 1.0933 1.1084 1.0772
irintensity: 0.7917 4.0924 0.9290 2.2674 0.9483 1.6085 0.2922 81.1641 10.0441 32.8085 6.8378 2.1254 1.4080 0.7778 9.2966 77.2488 4.8425 4.7516 2.5831 2.3086 0.5780 14.5734 5.3153 7.9482 14.3758 8.9059 9.3457 8.6732 1.5458 13.5751 2.8738 1.1129 15.4988 1.3580 24.1340 3.8521 10.6471 29.3425 30.4119 5.7806 2.2495 15.7841 2.6239 7.7622 2.1335 1.1598 0.2825 0.1036 2.7832 12.1157 55.5319 20.0885 13.5137 20.1715 27.3727 11.1441 2.3169 611.7507 27.8007 40.2585 20.6764 27.5160 15.3348 60.4551 72.9415 54.8997 17.9347 89.5972 38.3948 8.9112 0.9970 59.2417
temp: 298.150 k
press: 1.00000 atm
elementType: 8 7 7 6 6 6 6 6 6 6 6 6 1 1 1 1 1 1 1 1 1 1 1 1 1 1
symmnumber: 1
zpe: 580637.1 jmol-1
zpe.correction: 0.221153 hartree
zpe.thermalcorrener: 0.232090 hartree
zpe.thermalcorrenthalpy: 0.233035 hartree
zpe.thermalcorrgfe: 0.183729 hartree
zpe.sumelectzpe: -535.138347 hartree
zpe.sumelectthermal: -535.127409 hartree
zpe.sumelectthermalent: -535.126465 hartree
zpe.sumelectthermalfe: -535.175770 hartree
dipole: -1.7513 -1.0918 -0.5946
dipole: 2.1477
quadrupole: -64.9348 -72.7477 -73.7990
quadrupole: 0.8599 -3.3831 -0.1199
quadrupole: 5.5590 -2.2538 -3.3052 0.8599 -3.3831 -0.1199
hfenergy: -535.3594998 hartree
pointgroup: C01 [X(C9H14N2O1)]
dipole: -0.6898398 0.433253 0.224544 debye
dipolederiv: -0.6380606 0.162768 -0.001636 -0.1444596 -0.4641835 -0.2975178 -0.2881901 -0.2160568 -0.3597695 -1.6988815 0.0992884 -0.1675787 0.3569314 -0.4971654 0.148746 -0.09229 0.0977466 -0.3712241 -0.9562427 0.0508807 -0.1190255 0.5609176 -0.45648 -0.0166525 0.2690715 -0.1421404 -0.3213732 0.6870601 0.1356709 0.124337 0.3535156 0.2999894 0.0458718 0.3888337 -0.0081602 0.3263572 -0.044165 0.0549422 0.029039 -0.0243707 -0.0269525 0.0231224 -0.0268207 0.0784226 0.0663283 0.0425711 -0.003333 0.0149163 -0.0143069 0.0707465 0.003607 -0.0100436 -0.0063027 0.0853919 0.0900061 0.0057607 0.0446459 0.0141238 0.0711351 0.0262914 0.0209259 -0.0095024 0.0678116 0.1093874 0.0217631 0.0432397 0.0451765 0.0549432 0.0397599 0.0612119 0.0385805 0.0786856 0.0957986 0.0261599 0.020495 0.0425291 0.0527412 0.0271564 0.0423208 0.0438446 0.1191265 1.9389977 -0.2716477 0.1693346 -0.7095117 0.5296494 0.0828091 -0.0047802 0.1728468 0.3148843 -0.034826 -0.1857943 -0.0609844 -0.2392189 0.0637598 0.1523795 -0.1357778 0.1612389 -0.1151694 0.5057592 -0.0517168 0.1553155 -0.0673484 0.0291207 0.130505 0.1728447 0.1242256 0.0041885 -0.0385958 -0.0043571 0.1025603 -0.0592295 0.0354937 -0.0257713 0.0091974 0.0021511 -0.1209786 -0.0066834 0.1271328 0.011063 0.1235829 0.0064123 0.0186031 -0.0002134 0.024348 0.0497707 -0.0479529 -0.1038056 -0.1084089 -0.1109933 0.0360832 -0.0549153 -0.0716931 -0.070316 -0.0880784 -0.0706909 -0.0209669 -0.099644 -0.0503956 0.0505175 -0.107057 -0.071613 -0.059053 -0.0498739 0.0461496 -0.0733057 0.0597195 -0.0415224 -0.1622924 0.1094018 0.0607261 0.0663778 0.0259807 -0.034323 -0.0119359 -0.1083261 -0.0224065 0.0408393 -0.1074472 -0.1070601 -0.0551832 -0.0639158 0.0165284 -0.0549514 0.0432575 -0.0638817 -0.1726794 0.1053104 0.0445056 0.0851291 0.0334448 -0.1431189 0.1504077 -0.0048249 0.1246267 -0.0521883 0.0234983 -0.0210333 0.040295 0.0585505 -0.0265139 -0.1247177 -0.1006721 -0.0991367 -0.0033731 -0.0587265 -0.0971481 -0.0805904 -0.088427 -0.0469155 -0.0452349 -0.0882138 -0.0716733 -0.0142648 -0.0463904 -0.1646379 -0.0670218 -0.0395326 -0.0401227 0.0110201 0.1222002 0.0258882 0.0446514 -0.0083532 0.1755458 0.0026473 -0.1373519 0.2135567 0.0279635 -0.0288573 -0.0279312 0.2318636 -0.0780412 -0.1105326 -0.0841802 0.211645 0.0571269 0.0124235 -0.0536143 -0.0161879 0.1474026 -0.0879686 -0.0801611 -0.0794944 0.1611474 0.0241509 0.0655855 0.0016624 0.1152827 0.0842304 -0.0482209 0.0368117 -0.0598522 0.1523813 unknown
polarizability: 142.5919838|-5.993921|93.9605071|7.2908974|7.5819613|87.3936437 unknown
InChI: InChI=1S/C9H14N2O/c1-2-4-8(5-3-1)11-9-10-6-7-12-9/h6-8,11H,1-5H2
charge 0 multiplicity 1
26 atoms
O  2.278414 0.975699 0.85437
N  0.118723 0.721439 -0.090104
N  1.977026 -0.7615 -0.64146
C  -0.895448 0.072321 -0.95599
C  -1.308144 -1.325025 -0.416749
C  -2.127673 1.003188 -1.07171
C  -2.095437 -1.227165 0.90914
C  -2.931423 1.096934 0.250388
C  -3.332492 -0.306922 0.765338
C  1.402378 0.266838 -0.010024
C  3.523056 0.278884 0.711426
C  3.322163 -0.748598 -0.182181
H  -0.434067 -0.061709 -1.954178
H  -0.401608 -1.945631 -0.300295
H  -1.938013 -1.812234 -1.189237
H  -2.786244 0.588114 -1.859131
H  -1.811363 2.008029 -1.414462
H  -1.429547 -0.828617 1.701513
H  -2.406757 -2.237546 1.236491
H  -3.831851 1.720235 0.089161
H  -2.336221 1.615076 1.032155
H  -4.044989 -0.764322 0.0474
H  -3.863923 -0.219613 1.732649
H  -0.137474 1.526406 0.47921
H  4.351795 0.659917 1.296938
H  4.035021 -1.488697 -0.536259
