program: Gaussian 09
title: 000294117
version: EM64L-G09RevD.01
frameworkgroup: C1[X(C12H14N2O)]
method: RPBEPBE
basis: SDD
operation: Freq
keyword: #p
keyword: freq=noraman
keyword: PBEPBE/SDD
title: #p freq=noraman PBEPBE/SDD
converged: NO YES NO NO
title: Mulliken charges:
elementType: O N N C C C C C C C C C C C C H H H H H H H H H H H H H H
charge: -0.308342 -0.447431 -0.153254 -0.447165 -0.555516 -0.546241 0.296785 0.242382 -0.535712 -0.378318 0.485416 -0.483535 0.219988 -0.305112 -0.463562 0.222873 0.222845 0.229086 0.229061 0.224892 0.224904 0.326790 0.236233 0.219158 0.327285 0.227803 0.227801 0.230447 0.230440
chargesum: 0.00000
title: Mulliken charges with hydrogens summed into heavy atoms:
elementType: O N N C C C C C C C C C C C C
charge: -0.308342 -0.120146 -0.153254 -0.001448 -0.097369 -0.096445 0.296785 0.242382 -0.208922 -0.142085 0.485416 -0.264377 0.219988 0.150493 -0.002675
polarizability: 2.20773834e+02 -7.33061190e+00 1.49044890e+02 -8.03265699e-03 1.00609838e-02 7.83660214e+01
1716.lowfreq: -127.5337 -4.4518 -3.9074 -1.5244 0.0007 0.0009 0.0010 52.6877 53.4555
frequency: -127.5192 52.3603 53.2781 61.5685 95.2652 132.9120 187.7970 241.3266 253.1759 286.6743 322.1828 412.1268 430.7583 523.9202 552.8306 565.9880 585.0982 637.4111 678.2491 704.2881 704.7284 744.4778 749.7650 775.8832 796.6068 810.5062 817.7051 867.8593 901.3289 906.5286 916.6469 931.8960 934.7597 942.8540 964.6171 990.7005 1031.5847 1041.5524 1083.2694 1102.8400 1144.4688 1152.8955 1158.6784 1191.4658 1200.2488 1200.6512 1211.4445 1218.6212 1238.3630 1268.9874 1284.8400 1299.6399 1301.6871 1306.7453 1315.5522 1387.4685 1443.8501 1458.3035 1465.1615 1478.1018 1487.4117 1490.2768 1494.6912 1528.5692 1603.5035 1628.3916 1677.5587 2977.2224 2984.3975 3000.6119 3017.7027 3018.1797 3026.5830 3027.5914 3047.5364 3075.4073 3096.7490 3106.8269 3135.8301 3152.2128 3559.1910
redmass: 1.5953 2.6983 2.3927 6.3250 4.6223 3.4460 2.9548 4.1092 5.4860 6.5665 3.8462 3.9321 2.8313 5.6608 1.6757 1.8569 6.8436 6.2232 6.0899 2.5217 7.0172 1.1673 6.9813 5.8900 4.7259 1.4570 1.1624 8.7083 1.4565 3.3607 3.7060 1.3315 3.8698 1.3855 6.4800 4.6522 3.5139 1.7611 1.5754 2.9257 1.1914 1.7680 1.0972 1.9665 1.1061 1.1915 1.8212 1.3469 1.0680 1.8660 1.3382 1.8427 1.6142 1.4145 1.4287 5.9676 4.2099 1.1582 1.0845 1.0937 1.1197 1.1273 2.2074 2.2095 4.9863 6.7245 9.6008 1.0594 1.0596 1.0583 1.0620 1.1027 1.0579 1.1023 1.1078 1.1047 1.1113 1.0877 1.0962 1.0936 1.0758
irintensity: 0.3988 2.5556 0.0017 0.9854 1.4891 0.2182 1.4223 15.7314 1.5617 3.9648 0.1019 0.5576 11.2672 2.4602 51.5304 15.4723 10.3939 33.5662 1.3457 2.8237 9.2001 2.5605 13.8807 0.3619 0.6533 61.4063 0.8991 6.6945 5.8153 6.3137 63.6009 4.9094 7.1037 13.5978 119.3309 59.2252 4.8133 3.9807 0.0303 4.0555 0.0156 23.6631 0.4753 10.9950 0.1267 0.0012 25.8907 2.1908 0.0016 9.6657 0.6624 0.0926 12.3094 3.5542 25.5792 19.2231 57.4433 18.2139 11.3451 1.1797 17.9638 0.2263 24.1836 371.7139 31.9773 111.2500 560.2725 48.1758 31.2675 60.7362 84.3998 16.7677 85.2849 3.2983 12.3205 55.2096 43.2797 17.5719 24.4424 10.0177 43.5896
temp: 298.150 k
press: 1.00000 atm
elementType: 8 7 7 6 6 6 6 6 6 6 6 6 6 6 6 1 1 1 1 1 1 1 1 1 1 1 1 1 1
symmnumber: 1
zpe: 625987.5 jmol-1
zpe.correction: 0.238426 hartree
zpe.thermalcorrener: 0.250685 hartree
zpe.thermalcorrenthalpy: 0.251629 hartree
zpe.thermalcorrgfe: 0.198574 hartree
zpe.sumelectzpe: -649.302564 hartree
zpe.sumelectthermal: -649.290305 hartree
zpe.sumelectthermalent: -649.289361 hartree
zpe.sumelectthermalfe: -649.342416 hartree
dipole: 1.1345 0.2233 0.0046
dipole: 1.1563
quadrupole: -69.1056 -82.2707 -90.6325
quadrupole: -3.4002 0.0085 -0.0057
quadrupole: 11.5640 -1.6011 -9.9629 -3.4002 0.0085 -0.0057
hfenergy: -649.5409897 hartree
pointgroup: C01 [X(C12H14N2O1)]
dipole: -0.4457428 0.0907762 0.0051928 debye
polarizability: 220.8417842|6.8703364|148.9449694|-1.8785781|0.6207249|78.3979918 unknown
InChI: InChI=1S/C12H14N2O/c1-2-9-4-5-11(8-10(9)3-1)14-12-13-6-7-15-12/h4-5,8,14H,1-3,6-7H2
charge 0 multiplicity 1
29 atoms
O  -3.787871 0.831335 0.045013
N  -1.484942 1.110394 0.018795
N  -2.472011 -1.117951 0.010059
C  4.147639 -1.467361 -0.086435
C  2.639819 -1.90081 -0.069263
C  4.183225 0.102067 -0.07062
C  1.855402 -0.597617 -0.045196
C  2.721427 0.52254 -0.045947
C  0.454354 -0.447221 -0.023872
C  2.177347 1.825409 -0.024923
C  -0.084871 0.865996 -0.002901
C  0.777612 1.997343 -0.003397
C  -2.506979 0.190493 0.022995
C  -4.776099 -0.290004 0.045783
C  -3.890962 -1.58908 0.023517
H  4.655694 -1.859396 -0.984826
H  4.681191 -1.877814 0.788653
H  2.403614 -2.524876 0.813925
H  2.378596 -2.50752 -0.957491
H  4.704984 0.505153 -0.960284
H  4.729548 0.48672 0.812426
H  -0.227446 -1.302659 -0.023029
H  2.830372 2.706215 -0.025059
H  0.350505 3.008656 0.012984
H  -1.79017 2.084826 0.031877
H  -5.409117 -0.17488 -0.849644
H  -5.388551 -0.191841 0.957397
H  -4.0653 -2.219868 0.913801
H  -4.087307 -2.204348 -0.873042
