program: Gaussian 09
title: 000286737
version: EM64L-G09RevD.01
frameworkgroup: C1[X(C20H21N9O7)]
method: RPBEPBE
basis: SDD
operation: Freq
keyword: #p
keyword: freq=noraman
keyword: PBEPBE/SDD
title: #p freq=noraman PBEPBE/SDD
converged: YES YES NO NO
title: Mulliken charges:
elementType: O O O O O O O N N N N N N N N N C C C C C C C C C C C C C C C C C C C C H H H H H H H H H H H H H H H H H H H H H
charge: -0.282708 -0.397967 -0.235680 -0.416455 -0.225359 -0.224822 -0.213685 -0.141342 -0.452097 0.001611 -0.020324 0.051320 -0.027850 -0.083923 -0.609074 -0.576638 -0.137323 -0.392400 0.373445 -0.537523 0.346558 0.188688 -0.485269 0.145891 -0.321965 -0.490583 -0.423033 0.159159 -0.653594 0.116082 0.181186 -0.392200 -0.120797 -0.051929 0.148923 -0.034050 0.309415 0.253480 0.284238 0.267315 0.266821 0.355893 0.268497 0.258734 0.251125 0.266898 0.283969 0.235879 0.283219 0.247480 0.269895 0.391627 0.379316 0.334504 0.352478 0.334100 0.340843
chargesum: 0.00000
title: Mulliken charges with hydrogens summed into heavy atoms:
elementType: O O O O O O O N N N N N N N N N C C C C C C C C C C C C C C C C C C C C
charge: -0.282708 -0.006339 -0.235680 -0.037139 -0.225359 -0.224822 -0.213685 -0.141342 -0.096204 0.001611 -0.020324 0.051320 -0.027850 -0.083923 0.077908 0.098305 0.172092 0.145318 0.373445 -0.003386 0.346558 0.188688 0.041962 0.145891 -0.070841 -0.223685 -0.139063 0.159159 0.112984 0.116082 0.181186 -0.122305 -0.120797 -0.051929 0.148923 -0.034050
polarizability: 5.04548067e+02 3.31377408e+01 3.28291653e+02 -4.66295039e+00 -1.69493037e+01 2.20140644e+02
1716.lowfreq: -3.6247 -0.0008 -0.0004 0.0009 1.3439 2.4623 7.0785 11.3831 15.2630
frequency: 6.3679 10.8340 14.5931 19.3284 24.5907 29.7702 42.2369 48.7774 52.7856 61.4234 76.9397 83.1835 91.8523 96.2930 104.9702 123.8019 130.5125 142.1025 160.7659 169.3153 178.8802 199.4499 204.8187 206.0263 223.9652 249.6716 263.0020 274.6351 298.4228 305.3787 309.2570 320.4258 339.8159 352.8050 357.7066 389.1049 400.3310 424.4128 433.0015 436.7876 453.6319 460.2945 501.2112 503.6563 503.7356 513.6056 532.7205 544.4685 547.4284 555.7986 559.6757 562.5954 566.1830 572.9846 578.0763 587.8917 611.4901 620.5725 634.0729 636.9992 638.4894 641.8220 649.1758 680.4313 692.2899 706.4394 722.9562 732.9756 733.9537 739.7168 748.2266 767.0005 782.5923 809.8107 824.9005 835.0086 852.2196 886.9397 904.7756 907.5516 914.9417 918.2086 935.3863 941.3378 953.2742 993.3235 1008.4548 1026.0888 1035.5119 1046.5086 1060.3105 1063.1332 1099.0710 1100.1711 1102.8991 1107.9971 1114.6142 1136.2136 1152.0830 1161.3389 1185.1445 1195.4504 1199.7303 1223.4211 1232.0257 1244.3357 1247.0171 1255.1708 1266.6933 1278.4858 1283.1872 1287.2578 1291.2446 1321.1784 1334.8344 1336.0090 1352.9147 1358.7911 1372.3656 1376.8674 1381.1403 1382.1616 1412.1052 1430.4199 1439.8702 1441.6723 1447.8047 1464.7703 1468.7783 1471.9411 1477.8004 1481.8740 1490.3008 1505.7762 1526.3058 1528.3033 1536.8485 1561.6401 1585.0037 1601.6286 1622.1469 1625.0171 1647.7915 1669.5567 2975.6745 2991.0343 2996.7224 3012.5675 3036.7564 3043.2142 3050.6913 3065.0025 3091.7002 3101.8308 3135.0843 3151.8086 3153.9534 3171.0695 3514.8743 3516.3659 3518.0191 3521.7999 3554.4259 3682.5004 3714.5669
redmass: 7.2477 7.6347 7.5850 12.3467 7.2033 7.4234 7.2920 8.1731 10.1584 7.1381 4.8689 6.8879 3.2024 5.2230 6.8244 6.9443 4.7907 5.8936 6.4457 5.6277 5.6725 4.3413 5.1910 6.3030 4.5569 1.8361 1.6500 5.8532 5.2988 3.7938 3.9374 4.2871 7.5775 6.0077 5.3272 4.9479 3.3841 4.5444 4.3123 3.3890 4.7174 4.3122 7.7096 1.5935 1.3130 4.6097 4.6855 2.9506 4.1219 2.2224 3.4236 2.2836 1.5354 2.6246 2.5773 4.1644 1.3009 1.0767 5.5108 1.5952 1.4842 7.2650 5.3033 7.4430 6.9433 6.2584 5.4907 5.4608 5.6385 8.1596 4.2393 2.9427 2.3645 7.7758 11.1895 1.5578 3.9600 4.5757 3.7972 3.4137 1.6071 1.6558 3.3313 2.9236 2.4335 1.3538 2.3225 2.8614 3.2212 2.7363 2.1608 2.7007 2.5529 3.3965 2.2207 1.6300 1.7775 2.1908 1.7317 1.9612 1.5058 4.6943 1.7606 1.3910 2.1218 1.6259 2.5746 2.8915 1.6086 5.1784 1.6577 1.5667 1.3650 1.6981 4.0891 1.7693 2.2206 2.4428 3.4329 6.1766 3.4405 1.8231 3.9448 2.9563 1.2380 1.2976 4.0450 1.1749 1.1047 1.4540 1.1278 1.8964 1.9416 2.8807 3.9543 4.1248 5.3263 2.7181 8.0158 1.7734 4.8505 2.5285 8.4874 8.2638 1.0342 1.0617 1.0610 1.0815 1.0633 1.0958 1.1009 1.1008 1.1012 1.1036 1.0915 1.0873 1.0912 1.0963 1.0640 1.0732 1.0685 1.0447 1.0443 1.1049 1.1060
irintensity: 0.3291 0.9699 0.1977 1.2603 0.2402 0.9674 2.0062 0.8116 0.2748 0.7381 1.6598 4.5345 0.3785 3.3960 3.9437 4.9006 0.5293 7.2203 2.4983 9.0462 3.1383 3.7274 3.8311 5.7710 8.5113 0.1051 0.2356 7.5063 3.8872 15.4983 2.5673 3.6230 2.1344 0.3565 2.3370 17.1208 5.8991 21.6526 5.3657 0.4700 0.6538 9.7545 0.4485 89.2322 147.6080 26.4729 43.3905 35.3899 13.2210 106.1786 51.0892 96.4888 19.2382 53.5245 63.5170 9.0601 27.8606 61.0930 8.5320 120.5047 105.5292 0.5165 37.7953 39.9565 3.3341 2.4180 24.0666 2.7283 2.2688 24.8697 21.7340 13.1454 40.2602 2.6073 8.0554 27.0045 4.5342 3.0778 3.6659 5.1298 12.2288 18.9519 0.6534 5.5429 50.9408 3.9566 8.5490 124.0739 9.0556 285.7322 163.7215 23.4510 36.4097 6.6798 6.7886 23.7979 111.1647 2.0870 27.5675 13.3979 32.3887 368.3235 27.4219 4.7499 70.4763 19.0563 21.2605 20.4514 46.6184 18.4193 34.5644 21.2399 10.2258 118.0348 57.3284 80.5978 29.0429 251.0130 34.2665 157.4749 22.3740 69.1548 140.1945 10.6442 57.2157 21.1626 262.2853 6.3115 20.2836 65.1686 51.5469 34.7995 598.3987 106.9236 30.9435 53.0414 93.9037 368.7598 169.4646 863.7596 437.3942 114.2560 136.6919 218.3435 33.4380 8.9268 17.3391 13.3017 9.4220 6.1518 3.7169 21.2700 13.2072 9.3225 30.7978 2.4971 4.0854 11.3792 23.1584 96.6751 7.8686 94.5253 210.8112 75.4347 53.1776
temp: 298.150 k
press: 1.00000 atm
elementType: 8 8 8 8 8 8 8 7 7 7 7 7 7 7 7 7 6 6 6 6 6 6 6 6 6 6 6 6 6 6 6 6 6 6 6 6 1 1 1 1 1 1 1 1 1 1 1 1 1 1 1 1 1 1 1 1 1
symmnumber: 1
zpe: 1104607.9 jmol-1
zpe.correction: 0.420723 hartree
zpe.thermalcorrener: 0.454425 hartree
zpe.thermalcorrenthalpy: 0.455369 hartree
zpe.thermalcorrgfe: 0.348621 hartree
zpe.sumelectzpe: -1791.422773 hartree
zpe.sumelectthermal: -1791.389071 hartree
zpe.sumelectthermalent: -1791.388127 hartree
zpe.sumelectthermalfe: -1791.494875 hartree
dipole: 5.3727 -0.1524 -0.4095
dipole: 5.3904
quadrupole: -128.1203 -227.0728 -216.7102
quadrupole: 0.2984 -16.8189 19.1343
quadrupole: 62.5142 -36.4383 -26.0758 0.2984 -16.8189 19.1343
hfenergy: -1791.8434962 hartree
pointgroup: C01 [X(C20H21N9O7)]
dipole: 2.0002725 0.3058783 -0.6347831 debye
polarizability: 473.1830106|55.4063494|344.6097487|-61.1328415|-31.8975145|235.1876047 unknown
InChI: InChI=1S/C20H21N9O7/c1-28(8-10-7-23-17-15(24-10)16(21)26-20(22)27-17)12-4-2-9(6-13(12)29(35)36)18(32)25-11(19(33)34)3-5-14(30)31/h2,4,6-7,11,25,30,33H,3,5,8,21-22H2,1H3
charge 0 multiplicity 1
57 atoms
O  -4.040927 -0.033272 -1.675166
O  -8.033427 -1.789086 0.968865
O  -6.098312 -2.631152 1.93893
O  -5.766232 2.806305 3.556075
O  -6.759087 3.276458 1.510179
O  0.942126 -4.482324 0.597709
O  -0.792332 -4.087735 2.027918
N  2.013967 -1.874653 -0.261188
N  -4.499209 -1.168187 0.292036
N  -0.028986 -3.740458 1.038037
N  4.78497 0.088397 -1.786567
N  3.592304 2.145793 -0.175848
N  5.388696 3.605262 -0.721209
N  7.214326 2.82116 -2.204004
N  7.193341 0.637793 -3.08754
N  7.185958 4.971749 -1.30576
C  -5.935739 -0.880163 0.20142
C  -6.298847 0.597648 0.54645
C  0.639792 -1.759512 -0.4370
C  2.95585 -1.483368 -1.326678
C  -2.191723 -1.1533 -0.577264
C  -0.341984 -2.493686 0.321965
C  -5.867819 1.006546 1.965376
C  -3.631828 -0.748118 -0.70092
C  0.110869 -0.796538 -1.365233
C  -1.716631 -2.152411 0.289638
C  -1.252374 -0.511978 -1.436791
C  3.612811 -0.119139 -1.135152
C  2.639849 -2.364538 0.978219
C  -6.654058 -1.860821 1.121686
C  -6.191792 2.457205 2.26423
C  3.038006 0.924433 -0.334331
C  5.3623 1.32076 -1.64678
C  4.789734 2.378444 -0.845679
C  6.622634 1.613884 -2.32407
C  6.560661 3.756117 -1.405109
H  -6.272364 -1.053024 -0.839107
H  -7.387475 0.728459 0.420628
H  -5.802862 1.235816 -0.203692
H  3.761301 -2.240347 -1.37913
H  2.442492 -1.522531 -2.303997
H  -4.200322 -1.759194 1.072961
H  -4.779382 0.864505 2.106938
H  -6.356025 0.389264 2.745342
H  0.798691 -0.219716 -1.990202
H  -2.379598 -2.757157 0.916857
H  -1.634016 0.237723 -2.137423
H  3.566906 -1.789875 1.153587
H  2.87278 -3.443924 0.926531
H  1.968805 -2.201232 1.838209
H  2.097518 0.747577 0.199331
H  -8.476807 -2.431015 1.587355
H  -5.988145 3.762094 3.726218
H  8.069791 0.819988 -3.57117
H  6.716453 -0.261286 -3.15699
H  8.060045 5.125376 -1.801287
H  6.757325 5.697688 -0.73681
