program: Gaussian 09
title: 000294099
version: EM64L-G09RevD.01
frameworkgroup: C1[X(C9H10F6O)]
method: RPBEPBE
basis: SDD
operation: Freq
keyword: #p
keyword: freq=noraman
keyword: PBEPBE/SDD
title: #p freq=noraman PBEPBE/SDD
converged: YES YES NO NO
title: Mulliken charges:
elementType: F F F F F F O C C C C C C C C C H H H H H H H H H H
charge: -0.142854 -0.153621 -0.139332 -0.130180 -0.148393 -0.151171 -0.168201 -0.022532 -0.520624 -0.698672 -0.707105 0.174126 -0.291979 0.180973 0.307529 0.270139 0.227369 0.249570 0.267240 0.204749 0.214572 0.247147 0.211095 0.225137 0.209331 0.285685
chargesum: 0.00000
title: Mulliken charges with hydrogens summed into heavy atoms:
elementType: F F F F F F O C C C C C C C C C
charge: -0.142854 -0.153621 -0.139332 -0.130180 -0.148393 -0.151171 -0.168201 0.204838 -0.003814 -0.032204 -0.061541 0.174126 -0.006294 0.180973 0.307529 0.270139
polarizability: 1.30997957e+02 -6.82196040e+00 9.40634706e+01 -1.42671042e+00 3.60390954e+00 8.81980291e+01
1716.lowfreq: -19.3377 -5.3957 0.0002 0.0007 0.0008 4.4567 18.8322 37.5787 44.9821
frequency: 14.7050 37.5695 44.6716 54.7587 58.5718 92.8460 129.0209 150.3847 155.3423 188.7318 207.9154 226.2323 244.5939 266.7437 283.9095 310.9015 330.7165 356.3649 395.1621 415.3173 420.5036 454.9659 465.9721 487.2915 503.4900 568.9325 611.7902 644.9563 662.0226 699.3619 812.5075 833.6213 853.1951 893.3194 913.1777 922.4595 958.8444 965.1762 979.5163 1005.2843 1031.6350 1073.2290 1094.9799 1107.9904 1142.6081 1166.4817 1180.7301 1209.2342 1239.2616 1286.6102 1323.6226 1348.5360 1353.1496 1381.7890 1399.3361 1416.6317 1466.4641 1471.5013 1483.0104 1489.5580 1603.9623 1654.3010 2941.4796 2969.8301 2979.0719 2994.5494 3023.6117 3062.3611 3071.9162 3076.9430 3090.2093 3127.5392
redmass: 4.9356 6.3032 4.0319 6.8580 7.5846 7.7327 4.6366 8.4999 8.5855 3.8179 1.0601 6.2701 1.1589 14.8652 17.3586 18.0685 2.6064 2.4629 4.2812 2.6581 12.7929 4.8999 16.4683 6.6736 5.3838 5.9923 8.0161 6.8837 7.1449 7.9418 2.6779 3.2948 3.0167 2.3425 1.7718 1.4475 1.6686 1.7669 5.7710 8.4793 11.4513 5.3667 2.3200 2.2501 4.5476 2.8188 1.8312 1.6783 2.0545 1.4924 1.5313 2.1951 1.5529 1.2052 1.2081 1.1043 1.0496 1.0502 1.0553 1.0471 8.7457 10.2039 1.0668 1.0359 1.0377 1.0829 1.0899 1.0995 1.0994 1.0986 1.0994 1.0887
irintensity: 0.6341 0.0906 0.3093 0.3413 0.3500 4.9808 0.8489 2.5013 2.9017 5.8582 0.0732 1.0561 0.8566 1.7073 0.3474 0.2781 0.5604 3.1201 3.5909 6.4852 2.9640 2.6837 3.3950 4.2023 1.0137 24.5078 49.5184 2.5063 1.8177 9.7483 2.1241 7.1914 37.8842 65.2824 39.1674 15.0778 12.1576 5.1211 46.5657 28.8413 400.9217 100.2899 77.5576 16.9320 203.7171 150.7542 18.9345 149.8777 126.9249 29.4159 10.5789 76.3887 28.7142 21.0450 10.0563 36.1154 3.2925 9.9265 7.6427 25.9464 71.9016 48.0250 20.2885 32.3290 18.3581 5.8205 4.4320 29.6017 21.3645 70.1366 30.3208 3.6059
temp: 298.150 k
press: 1.00000 atm
elementType: 9 9 9 9 9 9 8 6 6 6 6 6 6 6 6 6 1 1 1 1 1 1 1 1 1 1
symmnumber: 1
zpe: 465843.7 jmol-1
zpe.correction: 0.177430 hartree
zpe.thermalcorrener: 0.194808 hartree
zpe.thermalcorrenthalpy: 0.195752 hartree
zpe.thermalcorrgfe: 0.129952 hartree
zpe.sumelectzpe: -1021.967795 hartree
zpe.sumelectthermal: -1021.950418 hartree
zpe.sumelectthermalent: -1021.949473 hartree
zpe.sumelectthermalfe: -1022.015273 hartree
dipole: 2.7457 -1.2968 2.0672
dipole: 3.6734
quadrupole: -95.7246 -94.0900 -96.8638
quadrupole: 1.9412 4.8675 -4.1309
quadrupole: -0.1652 1.4695 -1.3043 1.9412 4.8675 -4.1309
hfenergy: -1022.1452257 hartree
pointgroup: C01[X(C9H10F6O1)]
dipole: 1.1926149 0.8047658 0.1369007 debye
dipolederiv: -0.5514548 0.1321618 -0.1824319 0.1534792 -0.3952292 0.2185083 -0.1403633 0.1839498 -0.6080635 -0.4304373 0.087088 0.0625345 0.0703057 -0.514512 -0.2539292 0.0551328 -0.2507818 -0.5314257 -0.7949228 -0.2039787 0.0355837 -0.2009013 -0.5252266 0.0731157 0.1313746 0.0804654 -0.2799064 -0.6707407 -0.1648823 -0.1179948 -0.2565669 -0.369593 -0.1199392 -0.2438715 -0.1287422 -0.4176654 -0.5626718 0.2161598 -0.0608284 0.2418696 -0.5051182 0.0075678 -0.0505593 -0.0431284 -0.3598302 -0.3224888 -0.0961933 0.1245139 -0.1053538 -0.4602321 0.1319998 -0.0081142 0.1843284 -0.688683 -0.715079 0.0751788 -0.0913563 0.0326228 -0.4347334 0.2156902 0.0634168 0.2144737 -0.5878281 0.2477056 -0.0062459 -0.0205353 -0.0811194 0.1138941 0.0053853 0.0704303 0.0300726 0.1016879 -0.3535506 -0.0669352 0.1330889 -0.1310225 -0.0824641 0.2128014 0.188601 0.1366409 -0.0987992 -0.0347849 -0.0284409 0.0427014 -0.0129158 -0.0768933 -0.0330785 0.016611 -0.0272146 0.0672209 -0.0437447 -0.0399113 0.060511 0.0173817 0.0100184 0.0252985 0.031673 0.0122528 0.0806716 1.1816241 -0.0658727 0.0085778 0.0664345 0.4403804 -0.3405184 -0.3176323 -0.3285598 0.5926452 -0.0729478 0.02985 0.1085069 -0.0324697 -0.0772482 0.0638849 0.2975597 0.0275039 0.1011354 -0.5415863 0.0278929 -0.0870453 -0.0526741 -0.2996975 -0.0489824 -0.1099057 0.0255739 -0.302044 1.9819021 -0.063442 0.0692942 -0.1587013 1.4989844 -0.1189783 -0.1350418 -0.05105 1.366188 1.4803334 0.0639045 0.0300277 0.2280282 1.4064442 0.0803817 0.3117416 0.0231344 1.5913978 0.0577321 -0.0128763 -0.0252644 0.0220529 0.0345639 0.000426 -0.0632483 -0.0027576 -0.1261484 0.0789304 0.008371 0.034028 0.0656186 -0.0778661 -0.0691205 0.0174657 -0.0695874 0.0754155 0.0248616 0.0021047 -0.0343246 0.0351416 0.1160182 -0.0355844 -0.0833012 0.0197034 -0.0273391 0.0841069 -0.0008245 -0.0820469 0.0152756 0.0550361 0.0538515 -0.0660257 -0.0154895 -0.133039 -0.1452297 0.137725 0.0017117 0.104425 0.0322081 -0.0225352 -0.0035857 -0.0160725 0.0892978 0.0102037 -0.1214625 0.0611675 -0.1234866 0.009854 0.0356832 0.0616014 0.0680285 0.0371288 0.0931659 -0.0091873 0.0127713 -0.0585384 -0.1540323 -0.0837449 -0.0069438 -0.1072322 0.0309304 -0.1648257 0.0683245 0.0246113 0.1157784 0.0446189 0.0060279 0.0192269 0.0142439 0.086633 0.0554848 0.0077574 -0.1047942 -0.0179526 0.0778093 0.0133372 -0.0309123 0.0516271 -0.1380652 0.1084141 0.0237346 -0.0030075 0.0632885 0.1330161 -0.0175482 -0.0053298 -0.0313826 0.0784849 unknown
polarizability: 130.5624851|-4.1965266|86.8357258|6.9467054|-1.0723436|95.8612455 unknown
InChI: InChI=1S/C9H10F6O/c1-5(2)3-6(16)4-7(8(10,11)12)9(13,14)15/h4-5H,3H2,1-2H3
charge 0 multiplicity 1
26 atoms
F  -2.900998 1.671087 -0.838682
F  -2.494105 1.943888 1.378208
F  -3.375708 0.002526 0.623998
F  -1.91658 -0.92936 -1.646579
F  0.235147 -1.255731 -1.012074
F  -0.327626 0.590441 -2.199189
O  1.625374 -0.64494 2.053933
C  3.742649 0.061444 0.175316
C  2.355729 0.749492 0.160028
C  3.668034 -1.353576 -0.445689
C  4.774931 0.944019 -0.563584
C  1.344858 0.15897 1.127315
C  -0.085977 0.668312 1.083147
C  -1.031399 0.471237 0.128686
C  -2.433802 1.010038 0.318891
C  -0.773121 -0.274359 -1.161274
H  4.055713 -0.044891 1.232908
H  2.456723 1.822944 0.441068
H  1.932826 0.760526 -0.863977
H  3.349704 -1.303385 -1.504583
H  4.659284 -1.841012 -0.412726
H  2.956906 -1.997741 0.099318
H  4.874277 1.939817 -0.091558
H  5.770873 0.465424 -0.555628
H  4.48449 1.094641 -1.621201
H  -0.388703 1.20969 1.990129
