program: Gaussian 09
title: 000294100
version: EM64L-G09RevD.01
frameworkgroup: C1[X(C13H15NO2)]
method: RPBEPBE
basis: SDD
operation: Freq
keyword: #p
keyword: freq=noraman
keyword: PBEPBE/SDD
title: #p freq=noraman PBEPBE/SDD
converged: YES YES NO YES
title: Mulliken charges:
elementType: O O N C C C C C C C C C C C C C H H H H H H H H H H H H H H H
charge: -0.228264 -0.263682 -0.151582 0.121359 -0.379072 -0.427769 0.404249 -0.546018 -0.392642 0.183201 -0.504645 0.063856 -0.569881 -0.546345 0.331529 -0.535516 0.205285 0.218753 0.209212 0.224680 0.220303 0.228265 0.215887 0.220562 0.238044 0.240981 0.245453 0.297738 0.245722 0.215220 0.215119
chargesum: 0.00000
title: Mulliken charges with hydrogens summed into heavy atoms:
elementType: O O N C C C C C C C C C C C C C
charge: -0.228264 -0.263682 -0.151582 0.121359 0.044967 0.006123 0.404249 -0.097451 0.043807 0.183201 -0.025621 0.063856 -0.324428 -0.248608 0.331529 0.140545
polarizability: 2.03889334e+02 1.38590083e+00 1.81991267e+02 1.15384928e+00 -1.42322766e+00 8.69946387e+01
1716.lowfreq: -12.5371 -1.1476 -0.0009 -0.0005 0.0001 7.1927 57.9630 74.4869 83.2024
frequency: 57.8901 74.4812 83.1954 133.0343 169.7398 173.0354 192.5832 224.7940 257.9476 275.0851 303.1938 364.2355 373.8932 393.2484 395.6868 452.8248 483.4797 487.9038 514.2952 524.0679 555.4609 590.6557 639.0930 664.1556 684.6749 751.8383 810.8486 851.2823 875.8726 883.0631 890.5355 905.0198 925.2799 943.9164 995.6573 1015.9516 1037.4284 1054.8518 1079.0452 1086.9475 1109.6478 1109.7481 1149.3143 1155.5957 1167.3146 1185.0761 1199.9981 1218.5275 1226.5090 1257.8711 1270.2144 1299.2125 1319.3669 1323.1306 1326.8905 1346.9842 1352.3270 1385.9415 1398.3968 1429.9476 1433.1332 1443.1968 1454.9697 1464.2281 1464.7068 1467.0628 1473.4870 1477.6754 1513.5904 1573.0583 1582.7289 1631.5570 2896.2446 2902.8016 2947.9685 2961.1747 2982.5368 3001.1485 3021.6454 3031.3151 3031.6428 3039.5447 3067.7427 3081.2746 3118.9393 3132.0251 3166.8767
redmass: 3.1114 4.5594 2.7300 3.5440 3.9019 2.8738 2.5565 1.8417 1.6481 5.0742 1.8720 5.7645 4.5228 5.2065 3.5080 3.7870 4.6101 3.6958 3.8103 3.0369 3.4273 3.3080 3.1324 4.2910 3.9344 4.2335 2.2906 1.5178 2.8095 2.8397 1.9761 2.1505 1.4374 3.3747 2.3884 3.0539 2.8251 2.0423 1.7705 2.7540 1.5467 1.7052 1.4770 1.4539 1.9803 1.4017 1.4634 1.3766 2.1399 1.3899 1.3657 2.8479 2.1074 1.6777 1.6518 1.4323 1.4531 5.0804 2.0306 1.8522 1.1162 1.8407 1.2859 1.1705 1.0822 1.1245 1.0844 1.1877 1.6982 7.5533 10.0761 7.2178 1.0697 1.0714 1.0336 1.0653 1.0649 1.0645 1.0904 1.1009 1.0940 1.0906 1.1039 1.0956 1.0981 1.0906 1.0918
irintensity: 7.2243 0.1844 2.1861 2.6810 2.2769 3.7131 2.0189 3.2871 3.4872 8.3364 7.0417 2.3959 0.4478 9.1474 6.4080 3.1382 1.0175 6.3083 1.1158 1.3945 14.2540 3.1385 0.5003 20.8345 1.0517 7.9611 11.9289 16.1624 3.0241 15.0260 10.8149 4.0191 18.1361 18.1339 11.6053 38.8785 32.6919 1.2403 3.9620 40.5713 7.4207 11.1494 0.5990 5.8091 92.7864 1.0329 26.3579 35.2061 10.3426 18.6001 2.2935 190.0033 105.0553 15.7195 28.7030 23.4402 6.0288 25.5666 81.0468 70.4741 22.1012 9.2486 63.3479 82.9090 19.1115 27.2328 24.8265 11.0380 190.2752 39.3865 249.6019 2.8385 28.1980 171.2603 73.8346 38.1054 15.3942 14.2833 43.6883 26.2763 79.5160 47.1544 46.3580 17.8484 29.1209 12.0591 5.5439
temp: 298.150 k
press: 1.00000 atm
elementType: 8 8 7 6 6 6 6 6 6 6 6 6 6 6 6 6 1 1 1 1 1 1 1 1 1 1 1 1 1 1 1
symmnumber: 1
zpe: 668535.9 jmol-1
zpe.correction: 0.254632 hartree
zpe.thermalcorrener: 0.268445 hartree
zpe.thermalcorrenthalpy: 0.269389 hartree
zpe.thermalcorrgfe: 0.214384 hartree
zpe.sumelectzpe: -708.403220 hartree
zpe.sumelectthermal: -708.389407 hartree
zpe.sumelectthermalent: -708.388463 hartree
zpe.sumelectthermalfe: -708.443468 hartree
dipole: 1.5213 -6.5946 0.3486
dipole: 6.7768
quadrupole: -74.8143 -104.4964 -95.2571
quadrupole: 4.4799 0.9399 -0.2194
quadrupole: 16.7083 -12.9738 -3.7345 4.4799 0.9399 -0.2194
hfenergy: -708.6578519 hartree
pointgroup: C01 [X(C13H15N1O2)]
dipole: -0.5211027 2.6115543 0.1297255 debye
polarizability: 203.947776|0.7330339|181.9367555|-1.3268811|1.1503649|86.990708 unknown
InChI: InChI=1S/C13H15NO2/c1-16-10-7-9-3-2-5-14-6-4-12(15)11(8-10)13(9)14/h7-8H,2-6H2,1H3
charge 0 multiplicity 1
31 atoms
O  -0.760232 -3.399161 -0.054204
O  3.562994 -0.755123 0.039585
N  -1.942798 0.615319 0.038143
C  -0.570404 0.311798 0.024216
C  -2.384338 2.006094 0.254239
C  -1.452728 2.988919 -0.476906
C  0.416691 1.348747 0.016814
C  -0.00643 2.813907 0.031526
C  -2.87638 -0.450825 0.451154
C  -0.127649 -1.059899 0.014732
C  -2.560612 -1.763171 -0.282511
C  -1.100753 -2.177439 -0.078286
C  1.785113 1.010797 0.011935
C  1.254676 -1.366607 0.027913
C  2.214994 -0.342859 0.030326
C  4.58576 0.288704 0.038209
H  -2.408899 2.253469 1.341892
H  -3.418617 2.098897 -0.127285
H  -1.802223 4.023696 -0.307377
H  -1.501089 2.78884 -1.563621
H  0.065482 3.214034 1.064383
H  0.691106 3.41364 -0.582901
H  -3.905041 -0.120155 0.218997
H  -2.816606 -0.616083 1.553288
H  -2.721983 -1.625742 -1.371663
H  -3.21861 -2.581618 0.05545
H  2.516309 1.827291 0.001015
H  1.559475 -2.417404 0.019308
H  5.54555 -0.248793 0.050786
H  4.5114 0.934105 0.936494
H  4.526144 0.917424 -0.872946
