program: Gaussian 09
title: 000294116
version: EM64L-G09RevD.01
frameworkgroup: C1[X(C12H15ClN2O)]
method: RPBEPBE
basis: SDD
operation: Freq
keyword: #p
keyword: freq=noraman
keyword: PBEPBE/SDD
title: #p freq=noraman PBEPBE/SDD
converged: YES YES NO NO
title: Mulliken charges:
elementType: Cl O N N C C C C C C C C C C C C H H H H H H H H H H H H H H H
charge: -0.086336 -0.304434 -0.493960 -0.413917 -0.445670 -0.553387 -0.544857 0.340331 0.289788 -0.558037 -0.419336 0.509142 -0.483137 0.291075 -0.328184 -0.550217 0.215637 0.222478 0.228609 0.225811 0.221733 0.223388 0.315348 0.237243 0.213260 0.290344 0.295781 0.243745 0.269789 0.280789 0.267179
chargesum: 0.00000
title: Mulliken charges with hydrogens summed into heavy atoms:
elementType: Cl O N N C C C C C C C C C C C C
charge: -0.086336 -0.304434 -0.203617 -0.118135 -0.007555 -0.098967 -0.099736 0.340331 0.289788 -0.242689 -0.182093 0.509142 -0.269877 0.291075 0.185350 -0.002248
polarizability: 2.39738956e+02 -3.27646331e+00 1.56803705e+02 8.99280805e+00 -9.41125562e-01 8.68301265e+01
1716.lowfreq: -7.4496 -1.0937 0.0025 0.0027 0.0027 4.0456 15.1227 36.0186 57.4506
frequency: 15.0541 35.9020 57.4475 62.2000 95.2211 107.1496 137.8112 168.3789 220.0126 226.6116 254.7723 292.7565 319.4124 360.1370 402.8488 417.2932 429.9021 472.6455 522.6283 562.9657 582.4172 599.2312 605.7397 622.4830 702.3550 707.3595 708.9898 746.5409 778.5601 812.3277 849.8634 852.5271 881.8658 910.7742 927.2582 934.0354 935.8841 965.8801 986.7793 1018.5651 1040.7422 1049.6005 1089.5916 1121.9158 1128.9618 1156.5597 1165.3835 1179.9213 1200.1142 1210.0951 1215.2630 1236.3027 1259.0140 1271.9287 1291.5916 1293.5412 1298.1886 1314.6552 1365.8256 1379.5645 1435.0238 1439.3267 1444.0868 1460.4343 1461.9766 1479.1833 1480.6483 1493.8519 1515.2881 1600.0120 1627.5116 1638.4401 2967.3605 2973.3580 2992.0693 3002.5473 3039.7479 3047.5767 3050.5886 3065.2763 3074.9752 3102.4867 3136.4731 3154.3653 3181.2907 3525.5384 3544.8074
redmass: 6.9547 5.0390 5.7607 5.8629 4.1780 4.5537 2.7905 2.4582 6.0026 2.2288 3.3854 5.4775 2.8162 2.8567 1.6090 3.9703 2.5364 2.4808 4.2823 2.9838 3.5157 3.1426 1.4904 2.5559 7.9120 3.6593 3.2528 3.7164 3.8371 1.5014 2.1546 2.3317 1.5098 2.3715 1.6095 2.2845 1.4213 2.3371 2.5871 2.2572 1.8867 1.6725 2.8549 1.8821 1.4850 1.3613 1.2419 1.7508 1.5297 1.5198 1.4468 1.4065 1.3487 1.6917 1.3943 2.3804 1.2157 1.4249 1.4362 3.8380 3.2189 1.1455 1.1845 1.0992 1.1372 1.2055 1.5822 2.7449 2.3001 6.2876 6.5860 4.2948 1.0658 1.0659 1.0596 1.0645 1.0948 1.0942 1.0966 1.0621 1.1042 1.0880 1.0957 1.1120 1.0930 1.0762 1.0770
irintensity: 0.2129 0.5225 3.2897 8.9958 7.0582 6.4749 2.8084 0.3453 6.7114 2.7242 0.6796 1.2706 3.3588 31.2559 9.0220 2.3481 17.5716 17.5152 0.1681 25.3336 36.5988 8.0970 147.6490 2.6408 12.9001 6.7470 15.9676 1.2314 0.2574 59.2971 14.9332 4.1614 5.7646 6.3899 18.0599 6.8888 11.8837 6.4791 5.7338 1.7146 3.1430 6.0752 2.2036 6.7792 1.2031 10.2062 1.2378 1.3148 2.4033 132.1376 22.6969 278.5389 6.5733 3.4441 0.5055 15.9483 54.5502 24.0321 16.6864 44.0083 62.0828 7.1846 43.3724 9.2057 21.6567 34.0758 296.0673 48.1928 651.2099 82.2105 33.5037 130.9559 48.6864 32.5946 61.7243 38.5958 37.5202 33.4775 6.6984 22.9369 59.0992 21.7337 22.9170 17.2834 5.5198 7.0025 36.8353
temp: 298.150 k
press: 1.00000 atm
elementType: 17 8 7 7 6 6 6 6 6 6 6 6 6 6 6 6 1 1 1 1 1 1 1 1 1 1 1 1 1 1 1
symmnumber: 1
zpe: 660898.4 jmol-1
zpe.correction: 0.251723 hartree
zpe.thermalcorrener: 0.267041 hartree
zpe.thermalcorrenthalpy: 0.267985 hartree
zpe.thermalcorrgfe: 0.206541 hartree
zpe.sumelectzpe: -1109.912532 hartree
zpe.sumelectthermal: -1109.897213 hartree
zpe.sumelectthermalent: -1109.896269 hartree
zpe.sumelectthermalfe: -1109.957713 hartree
dipole: -0.1326 1.3558 -0.3091
dipole: 1.3969
quadrupole: -94.9120 -96.3055 -104.4030
quadrupole: 5.0038 3.8977 -3.1924
quadrupole: 3.6281 2.2347 -5.8628 5.0038 3.8977 -3.1924
hfenergy: -1110.1642545 hartree
pointgroup: C01 [X(C12H15Cl1N2O1)]
dipole: 0.0226996 0.5460009 0.0585308 debye
polarizability: 239.2543282|8.8191652|156.8175463|6.4245593|-6.8077798|87.3009129 unknown
InChI: InChI=1S/C12H15ClN2O/c13-6-7-14-12(16)15-11-5-4-9-2-1-3-10(9)8-11/h4-5,8,14-15H,1-3,6-7H2
charge 0 multiplicity 1
31 atoms
Cl 6.10326 1.058834 -0.871478
O  1.725984 -1.425734 0.547791
N  1.018778 0.818611 0.299263
N  3.292772 0.307918 0.52051
C  -4.693203 -1.280883 -0.561252
C  -3.36968 -1.834941 0.054163
C  -4.69459 0.242373 -0.214667
C  -2.44907 -0.620075 0.047916
C  -3.210012 0.568059 -0.105841
C  -1.049992 -0.590843 0.192873
C  -2.557221 1.816251 -0.116822
C  -0.394206 0.671218 0.174219
C  -1.15231 1.865399 0.02022
C  1.982182 -0.185123 0.458398
C  4.426316 -0.602197 0.671153
C  5.324343 -0.652969 -0.565099
H  -5.590632 -1.804823 -0.18837
H  -4.66265 -1.403367 -1.660139
H  -2.960484 -2.69227 -0.509693
H  -3.534857 -2.182224 1.094768
H  -5.202428 0.421984 0.755561
H  -5.22166 0.850697 -0.972105
H  -0.458919 -1.500775 0.313982
H  -3.123221 2.74738 -0.235688
H  -0.637734 2.8357 0.001681
H  1.35098 1.785044 0.276889
H  3.505352 1.293234 0.353823
H  5.028668 -0.332127 1.559239
H  3.998133 -1.609543 0.837443
H  4.765208 -0.882445 -1.483301
H  6.177895 -1.334065 -0.431641
