program: Gaussian 09
title: 000294114
version: EM64L-G09RevD.01
frameworkgroup: C1[X(C13H19ClN2O)]
method: RPBEPBE
basis: SDD
operation: Freq
keyword: #p
keyword: freq=noraman
keyword: PBEPBE/SDD
title: #p freq=noraman PBEPBE/SDD
converged: YES YES NO NO
title: Mulliken charges:
elementType: Cl O N N C C C C C C C C C C C C C H H H H H H H H H H H H H H H H H H H
charge: -0.086340 -0.282307 -0.519947 -0.401681 0.206021 0.174382 0.140325 0.398436 0.395068 -0.720977 -0.834475 -0.866838 -0.848397 -0.850167 0.262181 -0.329575 -0.551237 0.231613 0.224401 0.277116 0.224140 0.252608 0.246954 0.225919 0.295882 0.226733 0.235297 0.230228 0.229519 0.226947 0.234119 0.297018 0.242878 0.266946 0.281434 0.265776
chargesum: 0.00000
title: Mulliken charges with hydrogens summed into heavy atoms:
elementType: Cl O N N C C C C C C C C C C C C C
charge: -0.086340 -0.282307 -0.224065 -0.104663 0.206021 0.174382 0.140325 0.398436 0.395068 -0.489364 -0.108819 -0.141357 -0.156139 -0.159582 0.262181 0.180248 -0.004027
polarizability: 2.24683701e+02 1.81619537e+00 1.75071619e+02 2.16580985e+00 6.68235190e+00 1.15820516e+02
1716.lowfreq: -5.0584 -0.0012 0.0010 0.0012 5.1114 10.8513 14.7666 35.7559 57.6919
frequency: 12.3845 35.7421 57.6812 64.6355 79.4283 101.0751 108.6917 122.6106 149.6349 167.0609 170.9567 180.1755 197.0545 235.1272 241.4246 295.7111 312.2129 322.8122 339.2487 346.3800 354.1809 374.6691 423.2284 437.8879 473.1823 502.8819 541.2771 548.3570 584.5180 589.0886 592.1791 643.9850 683.7804 694.6176 717.8306 760.8757 825.2941 859.0944 878.0720 912.3265 956.9023 984.4317 994.6024 1018.0284 1023.4569 1029.3842 1034.7421 1048.1851 1051.7505 1057.4143 1083.7868 1092.3647 1146.3370 1177.3416 1210.8330 1236.1668 1239.9350 1249.4099 1299.4674 1323.7890 1360.3609 1369.4161 1392.1126 1394.5479 1401.2685 1402.4971 1409.9967 1433.7883 1439.7334 1441.8168 1456.6332 1464.6023 1466.5607 1469.0580 1476.4170 1484.0380 1485.4466 1489.0063 1492.9845 1509.5920 1588.1315 1619.9623 1642.3156 2953.1713 2969.0252 2970.3565 2981.5623 2995.2883 3037.2219 3043.4807 3046.4435 3053.3602 3061.6839 3064.4967 3080.0263 3080.5318 3089.5923 3100.7630 3113.7865 3152.7259 3517.5029 3543.4753
redmass: 6.5100 5.5285 6.2083 3.3564 4.7329 1.4434 3.0538 1.8280 2.2524 1.1097 1.4004 1.4119 1.6793 4.1014 3.9546 2.6824 3.0626 2.7797 2.7711 3.1765 2.6272 2.8948 1.4119 4.8359 2.3832 4.4050 2.5368 1.6335 3.3176 4.0422 2.9545 4.2857 4.4080 5.4116 4.9081 3.3253 2.8286 2.2512 1.3210 2.5470 2.1460 2.5475 1.3301 1.5196 1.4222 1.4898 1.7418 2.1237 1.6429 1.7120 2.7208 2.7920 1.8271 1.8786 1.5855 2.2262 2.1546 1.3749 1.1811 5.1444 3.9788 1.4400 1.2298 1.2949 1.2367 1.2629 2.7930 1.3804 1.1151 1.3952 1.1274 1.1690 1.1069 1.2242 1.0925 1.6587 1.1203 1.0742 1.1438 2.2278 5.9014 6.7576 5.2261 1.0470 1.0382 1.0382 1.0368 1.0594 1.0886 1.0971 1.0960 1.0915 1.0967 1.0673 1.0979 1.0989 1.0984 1.0951 1.0911 1.1119 1.0758 1.0769
irintensity: 0.6247 1.0480 2.7051 0.6986 9.8742 0.3741 5.4658 1.3581 9.3033 0.5281 0.0933 1.1510 2.3258 5.3292 2.6252 1.3731 0.8551 2.5850 4.2237 2.1892 1.1587 27.3933 27.8282 0.2489 7.5826 2.5122 45.9418 103.4282 0.2631 15.1453 55.6099 8.7604 2.0476 2.8621 29.9865 7.7346 6.4740 17.5084 9.4987 0.8590 19.2832 5.5731 6.7569 14.5475 3.1526 14.5311 0.6331 7.5448 0.6749 0.7287 0.2177 16.9135 2.0191 17.1905 148.1336 166.2404 81.8188 1.6144 48.4638 6.6003 32.7194 2.7159 2.4625 4.6331 30.3939 0.2570 6.5593 61.6335 9.9601 58.0106 10.1129 17.5383 16.2847 4.5534 9.0527 506.0429 19.4135 38.1176 2.1527 165.6171 5.8620 13.9344 134.4689 42.9925 52.6050 28.6157 24.6420 54.8523 22.7637 18.0142 24.1175 6.4396 10.9758 21.0418 9.2754 41.6475 18.2981 16.6902 28.1077 17.9273 11.6644 28.9689
temp: 298.150 k
press: 1.00000 atm
elementType: 17 8 7 7 6 6 6 6 6 6 6 6 6 6 6 6 6 1 1 1 1 1 1 1 1 1 1 1 1 1 1 1 1 1 1 1
symmnumber: 1
zpe: 782001.8 jmol-1
zpe.correction: 0.297849 hartree
zpe.thermalcorrener: 0.317064 hartree
zpe.thermalcorrenthalpy: 0.318008 hartree
zpe.thermalcorrgfe: 0.248715 hartree
zpe.sumelectzpe: -1150.314481 hartree
zpe.sumelectthermal: -1150.295266 hartree
zpe.sumelectthermalent: -1150.294322 hartree
zpe.sumelectthermalfe: -1150.363614 hartree
dipole: 0.1158 -1.5174 -1.0936
dipole: 1.8740
quadrupole: -105.6221 -100.1086 -115.3449
quadrupole: -1.1682 -7.5842 0.8281
quadrupole: 1.4031 6.9166 -8.3197 -1.1682 -7.5842 0.8281
hfenergy: -1150.6123295 hartree
pointgroup: C01 [X(C13H19Cl1N2O1)]
dipole: -0.0812339 -0.4986731 0.5369431 debye
polarizability: 223.2920412|1.833618|169.9662221|12.4391841|-17.7042875|122.3175726 unknown
InChI: InChI=1S/C13H19ClN2O/c1-8-7-9(2)11(4)12(10(8)3)16-13(17)15-6-5-14/h7,15-16H,5-6H2,1-4H3
charge 0 multiplicity 1
36 atoms
Cl 5.617167 0.2432 1.720048
O  1.552281 0.154897 -1.471425
N  0.588029 -0.545076 0.568562
N  2.903975 -0.703794 0.238192
C  -0.783827 -0.222641 0.278006
C  -1.155177 1.120118 -0.016583
C  -1.736238 -1.283656 0.344931
C  -2.525823 1.390201 -0.297563
C  -3.106294 -0.988872 0.106206
C  -3.468239 0.338853 -0.224251
C  -0.125046 2.231328 -0.022235
C  -1.267928 -2.697817 0.652597
C  -2.994736 2.791276 -0.655106
C  -4.181274 -2.06314 0.169219
C  1.665793 -0.326461 -0.304431
C  4.132687 -0.558383 -0.539606
C  5.023391 0.587529 -0.056691
H  -4.522983 0.561822 -0.429124
H  0.669682 2.036264 0.720087
H  0.371166 2.299511 -1.008406
H  -0.580509 3.208604 0.208535
H  -2.03782 -3.44358 0.40042
H  -0.356664 -2.947828 0.078672
H  -1.030953 -2.838298 1.728402
H  0.748165 -1.177661 1.355772
H  -2.85328 3.50063 0.183579
H  -2.437351 3.200142 -1.518346
H  -4.067458 2.792243 -0.913408
H  -4.028204 -2.847153 -0.597748
H  -4.203582 -2.571109 1.151921
H  -5.1793 -1.625426 -0.002854
H  3.00135 -0.899075 1.236512
H  4.70737 -1.503522 -0.53832
H  3.821979 -0.340703 -1.579606
H  4.484223 1.543909 -0.000494
H  5.944327 0.678866 -0.651767
