program: Gaussian 09
title: 000294098
version: EM64L-G09RevD.01
frameworkgroup: C1[X(C13H8F6O)]
method: RPBEPBE
basis: SDD
operation: Freq
keyword: #p
keyword: freq=noraman
keyword: PBEPBE/SDD
title: #p freq=noraman PBEPBE/SDD
converged: YES YES NO NO
title: Mulliken charges:
elementType: F F F F F F O C C C C C C C C C C C C C H H H H H H H H
charge: -0.128627 -0.154465 -0.157774 -0.148497 -0.133917 -0.145895 -0.165615 -0.604406 -0.561996 0.313672 0.370466 0.158898 -0.044669 0.000208 -0.391756 -0.342203 0.262705 0.271784 -0.217640 -0.239519 0.257043 0.279046 0.261312 0.251000 0.244802 0.283576 0.238772 0.243697
chargesum: 0.00000
title: Mulliken charges with hydrogens summed into heavy atoms:
elementType: F F F F F F O C C C C C C C C C C C C C
charge: -0.128627 -0.154465 -0.157774 -0.148497 -0.133917 -0.145895 -0.165615 -0.068318 -0.049685 0.313672 0.370466 0.158898 -0.044669 0.000208 -0.146954 -0.058627 0.262705 0.271784 0.021132 0.004178
polarizability: 2.08413925e+02 -2.73390292e+00 1.40157264e+02 1.17688916e+01 -1.57438933e+01 9.28810035e+01
1716.lowfreq: -7.4704 -5.8403 -0.0005 0.0007 0.0008 4.3017 20.0607 39.3878 57.2335
frequency: 19.8171 39.2958 57.2310 62.7011 83.5915 133.3708 156.5488 168.7106 178.8094 207.3783 227.1794 278.4302 280.2490 286.7727 303.2097 314.2756 366.9985 418.6938 424.9533 431.0321 463.5004 467.4356 487.0424 487.6079 493.9470 543.4687 593.5136 625.6031 636.2445 658.5329 680.6636 719.5580 739.3412 749.1068 796.9961 808.2702 867.8133 887.0250 897.3995 942.1920 955.7125 978.4197 989.0049 996.8498 1007.1987 1021.0978 1030.1841 1037.2543 1078.1050 1094.0161 1131.0907 1160.5645 1175.7490 1180.0417 1208.8741 1225.8596 1245.0519 1276.1981 1288.2986 1314.1014 1353.0078 1391.4321 1442.9085 1454.4652 1476.2448 1478.6944 1562.3905 1581.7635 1613.1543 1642.3160 2981.3023 3008.5238 3049.2973 3124.0827 3127.5808 3143.7467 3155.1820 3171.4416
redmass: 10.6504 8.5378 7.2999 14.5558 5.5759 4.5424 11.9875 6.9900 13.1638 6.0839 4.7115 5.0741 17.2416 13.8318 5.1699 6.2725 5.3066 4.6165 7.2248 4.9674 17.2830 8.4456 9.1497 3.9367 7.6740 5.4761 10.6231 10.2298 5.5701 9.3779 4.1906 4.4185 5.2105 1.7382 3.1893 2.7525 5.5304 2.1013 1.6247 6.7195 7.1094 1.4278 6.0590 4.5735 1.3595 11.3704 2.3691 2.1637 10.3821 2.6087 1.9229 2.7408 1.2064 1.4837 2.2085 1.8815 2.5197 2.3710 1.5408 2.1495 1.5510 6.5603 2.3602 1.1926 1.1692 1.9774 10.3898 7.0946 6.6225 10.2753 1.0643 1.0672 1.0974 1.0951 1.0877 1.0894 1.0939 1.1005
irintensity: 0.4121 0.1593 0.5889 0.3512 0.7960 1.1149 1.8151 0.2324 0.8312 1.3566 2.2059 3.5040 0.3393 1.4447 3.8597 2.7803 5.1674 1.9886 3.0250 10.6722 2.5432 6.8133 0.1081 4.9822 0.8105 4.4566 46.5490 20.5568 4.4733 0.3262 4.5572 10.6779 4.8272 47.6559 16.8202 24.3399 100.9340 36.7752 33.2824 15.8456 27.9370 5.9272 64.3563 23.2973 0.9629 349.8261 41.5097 2.2129 114.7368 29.6989 138.2182 109.2731 89.3944 121.8898 11.9553 42.1233 149.4526 176.4862 33.5248 44.7805 13.4623 5.4350 16.8870 21.8360 18.5620 11.6242 165.1479 60.4472 16.5508 59.9137 10.0689 5.3621 14.4955 5.4906 4.1567 9.1924 7.5514 22.8459
temp: 298.150 k
press: 1.00000 atm
elementType: 9 9 9 9 9 9 8 6 6 6 6 6 6 6 6 6 6 6 6 6 1 1 1 1 1 1 1 1
symmnumber: 1
zpe: 479318.0 jmol-1
zpe.correction: 0.182563 hartree
zpe.thermalcorrener: 0.199799 hartree
zpe.thermalcorrenthalpy: 0.200743 hartree
zpe.thermalcorrgfe: 0.136187 hartree
zpe.sumelectzpe: -1173.006638 hartree
zpe.sumelectthermal: -1172.989402 hartree
zpe.sumelectthermalent: -1172.988458 hartree
zpe.sumelectthermalfe: -1173.053013 hartree
dipole: -6.5338 3.8831 -0.6884
dipole: 7.6317
quadrupole: -104.6095 -111.7609 -117.0648
quadrupole: -1.5277 4.2391 1.2417
quadrupole: 6.5356 -0.6159 -5.9197 -1.5277 4.2391 1.2417
hfenergy: -1173.1892009 hartree
pointgroup: C01 [X(C13H8F6O1)]
dipole: -2.6133457 1.4560934 -0.2557649 debye
polarizability: 208.8658253|-1.0160772|139.4915589|10.3597245|-16.2607207|93.0948084 unknown
InChI: InChI=1S/C13H8F6O/c14-12(15,16)11(13(17,18)19)9-6-5-7-3-1-2-4-8(7)10(9)20/h1-4H,5-6H2
charge 0 multiplicity 1
28 atoms
F  4.007962 0.545125 -0.072809
F  2.736101 1.919242 1.174095
F  2.570412 1.985263 -1.085626
F  2.805253 -1.208894 -1.614295
F  2.766575 -2.088059 0.479641
F  0.906514 -2.109186 -0.822737
O  -0.434268 -1.668882 1.541133
C  -0.147533 1.781314 0.716081
C  -1.30613 2.008516 -0.299508
C  0.368301 0.369451 0.506685
C  -2.378917 0.933825 -0.214252
C  -2.077738 -0.345075 0.343905
C  -0.706856 -0.662864 0.825677
C  1.62517 0.046392 0.074821
C  -3.697048 1.182871 -0.662513
C  -3.085027 -1.3428 0.447089
C  2.720255 1.092745 0.016651
C  2.013617 -1.328074 -0.438049
C  -4.691917 0.184948 -0.571085
C  -4.387201 -1.082864 -0.012997
H  -0.543664 1.879512 1.744976
H  0.626434 2.548429 0.578881
H  -0.879506 2.035191 -1.322358
H  -1.751157 3.003704 -0.117865
H  -3.947729 2.165004 -1.080234
H  -2.814575 -2.309363 0.884669
H  -5.706568 0.395035 -0.92693
H  -5.162456 -1.852405 0.05855
