program: Gaussian 09
title: 000294069
version: EM64L-G09RevD.01
frameworkgroup: C1[X(C3H9NO4S)]
method: RPBEPBE
basis: SDD
operation: Freq
keyword: #p
keyword: freq=noraman
keyword: PBEPBE/SDD
title: #p freq=noraman PBEPBE/SDD
converged: YES YES NO NO
title: Mulliken charges:
elementType: S O O O O N C C C H H H H H H H H H
charge: 1.176407 -0.429034 -0.547240 -0.457135 -0.482112 -0.544449 -0.371763 -0.255080 -0.373392 0.214996 0.222525 0.217796 0.232832 0.216948 0.216579 0.284579 0.283709 0.393834
chargesum: 0.00000
title: Mulliken charges with hydrogens summed into heavy atoms:
elementType: S O O O O N C C C
charge: 1.176407 -0.429034 -0.153406 -0.457135 -0.482112 0.023838 0.065759 0.195548 0.060135
polarizability: 2.37158498e+02 -2.52515181e+00 7.29746446e+01 2.54021570e+00 -8.83824518e-01 6.93683699e+01
1716.lowfreq: -11.3240 -9.1263 0.0006 0.0015 0.0020 2.7327 29.7541 40.0418 70.6167
frequency: 29.3716 39.9769 70.6094 97.6164 121.9792 129.9866 164.2054 201.1732 240.9625 278.5163 294.4049 320.3670 338.6070 368.6812 430.1956 481.1696 539.7409 565.8130 760.7021 846.7142 860.2658 911.9424 975.9459 981.6221 991.0226 1050.3127 1096.3257 1117.0629 1155.6825 1240.8915 1268.1634 1271.4525 1333.2575 1339.5237 1356.2887 1460.8262 1470.6329 1487.9805 1642.4936 2978.2954 2991.5257 3008.5597 3040.2697 3049.3188 3084.8444 3461.3202 3494.6897 3626.2482
redmass: 5.6644 2.0271 5.6994 3.2983 2.0340 2.1165 4.8278 7.5843 2.3398 1.0745 4.4836 6.8745 5.1594 8.0785 3.0554 2.3079 3.5150 13.0514 1.0760 1.1575 11.0993 8.9920 5.3009 6.6203 1.1802 4.3918 1.2362 4.5013 1.3061 1.3639 1.2230 1.1326 1.1652 1.2334 1.2394 1.0830 1.0865 1.0852 1.0943 1.0544 1.0592 1.0582 1.1058 1.1066 1.1077 1.0655 1.0447 1.1001
irintensity: 1.7738 0.0135 4.3605 6.8887 0.3064 53.7486 31.3860 8.3337 54.8085 43.0009 2.7793 30.0743 9.0767 109.0949 20.1545 485.4525 224.0050 94.4616 7.6048 0.4530 127.9113 25.9954 134.3879 116.4490 3.4566 45.8441 100.2489 31.8118 2.6165 0.3167 4.5620 1.0972 0.0414 17.4928 2.4328 20.3354 4.6181 15.0643 51.6074 17.7215 41.9370 47.5239 12.1516 1.2450 63.8575 68.3704 69.5154 5.7462
temp: 298.150 k
press: 1.00000 atm
elementType: 16 8 8 8 8 7 6 6 6 1 1 1 1 1 1 1 1 1
symmnumber: 1
zpe: 347321.1 jmol-1
zpe.correction: 0.132288 hartree
zpe.thermalcorrener: 0.144892 hartree
zpe.thermalcorrenthalpy: 0.145836 hartree
zpe.thermalcorrgfe: 0.091929 hartree
zpe.sumelectzpe: -872.456036 hartree
zpe.sumelectthermal: -872.443431 hartree
zpe.sumelectthermalent: -872.442487 hartree
zpe.sumelectthermalfe: -872.496394 hartree
dipole: -6.3552 1.9932 -0.5708
dipole: 6.6848
quadrupole: -70.0654 -60.4066 -64.0825
quadrupole: -3.5129 -2.5930 -3.1818
quadrupole: -5.2139 4.4449 0.7690 -3.5129 -2.5930 -3.1818
hfenergy: -872.5883233 hartree
pointgroup: C01 [X(C3H9N1O4S1)]
dipole: 2.501148 0.7711067 0.2580685 debye
dipolederiv: 1.5355646 -0.0201774 0.0286055 -0.0626717 1.6362112 0.0771766 -0.1803329 0.0405982 1.4470523 0.6406114 0.1376029 0.0312696 0.0825515 -0.4773927 0.0066783 0.0062662 0.0106374 -0.438473 -0.6578332 0.0382295 0.0478764 0.8413158 -0.9190392 -0.1342105 0.3805724 -0.1385758 -0.5976682 -0.9710884 -0.0503824 -0.0862678 -0.2957303 -0.4428197 -0.0126684 -0.4487636 -0.0353027 -0.5604859 -0.7033286 -0.0124744 -0.0172091 -0.4566722 -0.5402857 0.0803406 0.4002191 0.1325467 -0.5683636 -1.7752257 0.1556003 -0.0223431 0.2917586 -0.5168341 0.0278459 -0.0594076 0.0281438 -0.1749105 -0.4627366 0.0177002 -0.001353 0.8825957 0.0153251 -0.0103337 -0.0821087 0.001468 0.1609849 0.1409311 -0.1150415 -0.005322 -0.2695981 0.2976748 0.0581996 0.0098876 0.0177153 0.3184238 1.1984033 0.0056806 0.0079662 -0.7313115 0.3538811 0.0006232 0.0654435 -0.0070875 0.2191501 0.0416303 0.0021581 -0.0016609 -0.025423 -0.0279612 -0.1007384 -0.0152132 -0.1187127 -0.0504746 0.0447411 -0.002086 0.0054859 -0.0260816 0.0073754 0.0863042 0.0231545 0.1076817 -0.0725048 0.0222331 0.0105181 -0.0108181 0.0534396 -0.04399 -0.0887692 -0.0052893 -0.1209797 -0.0550437 0.0358623 -0.0092522 0.0249337 0.0577116 0.0041412 0.0605295 0.0019152 0.0949436 -0.0598924 0.0104273 -0.0262614 0.0240147 0.097742 -0.0006773 0.0975481 0.0007459 0.1345975 -0.0803218 0.015804 -0.0224482 -0.0163125 0.1022136 -0.0331151 -0.1054418 -0.0076786 -0.1433442 -0.0504609 0.4356125 -0.0714708 -0.058603 -0.1839876 0.1918115 0.0993152 -0.1383346 0.0632262 0.0923271 0.420769 -0.0578534 0.0756476 -0.1539253 0.1656676 -0.1184973 0.1773881 -0.0775912 0.119199 0.0276225 0.0199579 -0.0259102 -0.2039271 0.330027 -0.0239019 -0.128464 0.0100354 0.3514622 unknown
polarizability: 237.1740451|2.3936463|72.8699453|2.123274|1.0638001|69.4575216 unknown
InChI: InChI=1S/C3H9NO4S/c4-2-1-3-8-9(5,6)7/h5H,1-4H2
charge 0 multiplicity 1
18 atoms
S  -2.232906 -0.170789 -0.066374
O  -0.466679 0.53225 -0.236367
O  -2.861668 1.473825 0.426516
O  -2.935949 -0.548407 -1.455059
O  -2.261886 -1.214608 1.159041
N  4.445527 0.180514 -0.054285
C  1.908669 0.376173 -0.132064
C  0.618176 -0.460035 -0.10955
C  3.176922 -0.543187 -0.036894
H  1.906342 1.087388 0.714796
H  1.950294 0.963772 -1.067683
H  0.592131 -1.16523 -0.963142
H  0.517616 -1.020244 0.840597
H  3.122828 -1.140069 0.893101
H  3.167426 -1.260202 -0.879313
H  4.707256 0.623889 -0.936852
H  4.662865 0.743287 0.770332
H  -2.046164 1.986373 0.707399
