program: Gaussian 09
title: 000293854
version: EM64L-G09RevD.01
frameworkgroup: C1[X(C12H11N3O3)]
method: RPBEPBE
basis: SDD
operation: Freq
keyword: #p
keyword: freq=noraman
keyword: PBEPBE/SDD
title: #p freq=noraman PBEPBE/SDD
converged: YES YES NO NO
title: Mulliken charges:
elementType: O O O N N N C C C C C C C C C C C C H H H H H H H H H H H
charge: -0.247541 -0.305790 -0.231939 -0.141960 -0.448091 -0.393170 -0.555866 0.208042 0.261052 -0.074416 0.485952 -0.274902 0.151039 -0.444346 -0.352989 -0.194937 -0.212608 -0.252039 0.254250 0.281945 0.266710 0.366765 0.366257 0.262144 0.237677 0.302523 0.228382 0.227773 0.230083
chargesum: 0.00000
title: Mulliken charges with hydrogens summed into heavy atoms:
elementType: O O O N N N C C C C C C C C C C C C
charge: -0.247541 -0.305790 -0.231939 -0.141960 -0.081327 -0.026913 -0.019670 0.208042 0.261052 0.192294 0.485952 -0.012758 0.151039 -0.206669 -0.050467 0.033445 0.015165 -0.021955
polarizability: 2.21601491e+02 -8.01769980e+00 1.61525147e+02 5.89141866e+00 -1.15090540e+01 1.05829826e+02
1716.lowfreq: -4.7991 0.0005 0.0006 0.0009 3.7369 9.0603 27.0156 38.1608 64.9092
frequency: 26.9963 38.1407 64.9043 72.7988 92.7326 129.3118 162.2159 188.5123 239.3260 260.3710 299.0485 342.1802 366.6180 394.3236 407.9081 415.8262 455.9191 508.7749 516.3550 524.9155 590.1020 613.4168 623.7734 682.6050 692.6926 698.2580 718.2570 741.6453 769.1750 772.5980 804.8684 811.1999 821.6614 839.6265 863.4262 924.1093 925.8626 933.2282 948.7666 955.6438 978.0197 985.6513 1000.6633 1027.4232 1064.3023 1089.6956 1169.6223 1173.1556 1185.8876 1189.4740 1208.5113 1233.9487 1273.8953 1316.7746 1325.3171 1340.6400 1345.9693 1378.1557 1386.8329 1413.9919 1437.2379 1452.6632 1486.4807 1545.1051 1596.4252 1604.7769 1615.3605 1616.9439 1647.1817 1670.8041 3038.7294 3120.8186 3124.3605 3133.8939 3146.8220 3166.2189 3179.0739 3193.5503 3218.8085 3334.0960 3521.2282
redmass: 7.6086 4.2188 5.4392 9.1583 6.5819 6.3963 6.2481 8.3150 7.4914 5.0042 5.9288 5.9709 7.2451 2.9554 2.9254 3.3266 6.1892 4.4173 5.0818 3.6419 5.9440 6.3169 5.7537 3.2107 3.1126 1.9494 3.4157 6.4520 1.6630 1.7693 3.2490 2.3025 2.1143 1.7871 1.2690 3.3856 1.5796 3.4789 1.3207 2.5249 1.3551 6.2020 1.3081 2.1370 2.0593 1.5476 4.5829 1.0778 1.6600 1.1927 2.2764 2.0417 2.1758 2.8610 1.4288 1.3264 1.4956 1.8405 7.6689 3.6956 2.3205 1.1178 2.3857 2.1587 4.8349 5.3011 5.7380 8.8996 4.0010 5.8680 1.0618 1.0879 1.1034 1.0875 1.0939 1.0999 1.0918 1.0953 1.0979 1.0809 1.0772
irintensity: 0.1563 2.2092 4.9429 7.3218 1.9633 2.3676 3.8933 13.2573 3.0480 1.9395 3.1521 1.7644 17.0083 7.8846 0.0670 9.2220 29.4235 21.2952 10.1345 25.5588 2.5187 0.4231 1.1843 20.0827 5.3370 44.9531 2.4950 2.3551 45.8380 43.3839 43.6648 86.5896 69.8275 26.3072 78.4844 2.1200 26.0237 8.2341 0.3178 1.2920 0.1472 0.1984 3.2077 6.0304 5.0104 17.1451 15.1662 0.3310 54.2722 19.0987 24.8345 30.8981 13.3047 58.4157 17.0765 13.1216 49.5331 24.8660 19.2781 76.2669 59.6688 32.9066 61.0648 444.0459 120.7554 155.2103 13.3017 67.1718 280.0635 707.3814 10.9762 8.4440 1.9625 1.6080 28.2362 24.8312 1.6402 5.9303 0.7943 236.9468 59.8460
temp: 298.150 k
press: 1.00000 atm
elementType: 8 8 8 7 7 7 6 6 6 6 6 6 6 6 6 6 6 6 1 1 1 1 1 1 1 1 1 1 1
symmnumber: 1
zpe: 575263.8 jmol-1
zpe.correction: 0.219106 hartree
zpe.thermalcorrener: 0.234021 hartree
zpe.thermalcorrenthalpy: 0.234965 hartree
zpe.thermalcorrgfe: 0.175328 hartree
zpe.sumelectzpe: -852.576261 hartree
zpe.sumelectthermal: -852.561347 hartree
zpe.sumelectthermalent: -852.560403 hartree
zpe.sumelectthermalfe: -852.620040 hartree
dipole: 0.4199 1.0010 1.6473
dipole: 1.9728
quadrupole: -111.6861 -103.5700 -106.8876
quadrupole: -18.5052 -8.3641 -1.9000
quadrupole: -4.3049 3.8112 0.4936 -18.5052 -8.3641 -1.9000
hfenergy: -852.7953676 hartree
pointgroup: C01 [X(C12H11N3O3)]
dipole: -0.1539764 -0.4380252 -0.6219583 debye
polarizability: 222.6359284|5.2834005|121.7143695|-2.4206078|-27.3935429|144.6061663 unknown
InChI: InChI=1S/C12H11N3O3/c16-10-6-7-15(12(18)14-10)8-11(17)13-9-4-2-1-3-5-9/h1-7,13-14H,8H2
charge 0 multiplicity 1
29 atoms
O  -0.865164 1.144057 -2.383875
O  0.876048 -2.021144 0.416623
O  4.61562 0.241282 2.096326
N  1.822435 -0.313714 -0.890062
N  -1.291841 -0.491504 -0.727745
N  2.766641 -0.877984 1.201376
C  0.825155 -0.579624 -1.958022
C  -0.536969 0.119881 -1.711453
C  1.770494 -1.130768 0.263501
C  2.758913 0.714708 -1.010057
C  -2.575228 -0.115305 -0.234278
C  3.712782 0.959805 -0.053304
C  3.786375 0.136635 1.152316
C  -3.108632 -0.889739 0.831671
C  -3.32048 0.972961 -0.761834
C  -4.375359 -0.580646 1.365397
C  -4.587998 1.268552 -0.214531
C  -5.124093 0.501435 0.845018
H  1.22256 -0.194117 -2.908771
H  0.694019 -1.673138 -2.028307
H  2.678972 1.31559 -1.919514
H  -0.828689 -1.286885 -0.255262
H  2.752479 -1.467653 2.040404
H  4.436204 1.766966 -0.169115
H  -2.529862 -1.728319 1.238634
H  -2.9034 1.563787 -1.579312
H  -4.776639 -1.183541 2.187309
H  -5.160218 2.108606 -0.623879
H  -6.10873 0.741616 1.259946
