program: Gaussian 09
title: 000293815
version: EM64L-G09RevD.01
frameworkgroup: C1[X(C13H11N3O4)]
method: RPBEPBE
basis: SDD
operation: Freq
keyword: #p
keyword: freq=noraman
keyword: PBEPBE/SDD
title: #p freq=noraman PBEPBE/SDD
converged: YES YES NO NO
title: Mulliken charges:
elementType: O O O O N N N C C C C C C C C C C C C C H H H H H H H H H H H
charge: -0.281603 -0.255190 -0.177732 -0.212351 -0.449669 0.024853 0.004190 0.328669 0.233764 -0.424549 -0.322656 0.167767 -0.316242 0.418382 -0.209060 -0.225221 -0.261722 -0.484942 -0.182769 -0.343939 0.235841 0.274030 0.243006 0.282837 0.385127 0.243494 0.248891 0.311129 0.273065 0.229864 0.242738
chargesum: 0.00000
title: Mulliken charges with hydrogens summed into heavy atoms:
elementType: O O O O N N N C C C C C C C C C C C C C
charge: -0.281603 -0.255190 -0.177732 -0.212351 -0.064542 0.024853 0.004190 0.328669 0.233764 0.085321 -0.079649 0.167767 -0.033405 0.418382 0.034434 0.023670 0.049406 -0.211877 0.047095 -0.101201
polarizability: 2.23527713e+02 -3.44866284e+00 2.00826037e+02 -9.53366963e+00 4.14490348e+00 1.20757354e+02
1716.lowfreq: -2.3933 -0.0007 -0.0005 0.0001 2.8501 5.6540 14.5279 36.9160 49.1242
frequency: 14.4443 36.9005 49.1171 67.5289 90.7371 103.9890 106.1329 134.3952 189.4387 196.7784 248.9378 258.6913 289.7660 324.6026 354.4558 370.1135 406.8528 413.0425 457.6684 480.5133 502.1254 530.5421 550.4939 572.6819 589.1459 609.8990 640.5390 666.9268 682.9642 720.5254 732.5782 755.4636 769.6134 804.5823 822.0668 844.1442 859.3086 892.5022 916.2420 928.0837 943.7173 957.3480 972.5361 988.8002 994.4102 1000.1589 1000.5072 1032.7324 1039.2301 1070.6135 1116.1754 1141.3209 1175.5725 1196.0837 1204.2054 1214.6458 1221.7450 1243.3785 1267.2749 1271.8380 1319.9551 1333.0629 1340.0746 1359.6357 1387.0104 1405.3672 1437.7707 1454.6079 1466.7245 1468.8144 1529.6790 1581.4889 1583.6546 1587.5933 1604.2245 1620.9286 3039.7986 3107.2592 3116.6961 3135.6612 3148.8699 3160.3472 3165.6156 3174.7550 3187.2614 3195.4102 3305.3528
redmass: 6.0518 5.9484 7.1042 6.7220 8.0207 7.1009 5.3870 7.6920 5.3505 5.7152 5.0439 5.6653 3.5470 7.7417 5.9239 7.4275 3.2681 4.3966 5.7123 5.0943 4.0494 5.1850 4.5726 4.5748 4.7669 7.5687 6.7684 5.4345 6.2437 2.0739 4.3459 6.5718 1.3783 7.3882 1.5660 6.3142 1.4605 1.2085 4.5247 1.3763 1.5080 1.3957 6.4570 1.3619 2.1104 1.5914 2.7911 2.6650 2.4959 3.7035 1.5510 1.7073 1.1630 1.7742 1.5815 3.0583 2.6374 1.9275 1.5921 2.4253 1.3158 4.1358 1.4988 8.3394 7.4147 2.0906 2.3683 1.1159 2.2820 2.3889 2.8890 4.3866 6.6749 3.8368 6.4281 4.1854 1.0572 1.1066 1.0916 1.0883 1.0870 1.0966 1.0899 1.0947 1.1001 1.0962 1.0810
irintensity: 1.8882 0.2594 1.1004 7.3265 3.4117 3.7318 0.6162 3.8111 1.0868 10.2070 4.9006 2.6804 7.4740 0.5480 1.1849 1.4830 2.7086 2.1835 17.0422 5.6508 5.3677 2.6388 6.7008 6.6036 1.8084 6.5165 9.0903 10.5909 8.6488 30.4818 16.1193 7.1733 77.5982 11.2552 39.5208 2.9854 1.0068 63.7609 12.9141 44.9014 19.9138 3.8010 77.0355 1.9723 5.4179 4.3182 3.6019 2.4029 6.7681 25.8599 13.6963 25.7879 29.6860 19.8824 26.5704 146.0512 4.0080 129.6649 48.9795 26.2114 8.1282 14.8770 24.8064 217.4271 9.2962 22.8170 21.4994 26.9690 139.9388 107.3988 216.1482 119.0654 57.0258 39.4971 101.7924 138.6677 18.3675 6.0051 22.1773 5.6575 3.3915 31.8270 7.7938 2.6534 7.3974 5.3089 468.9313
temp: 298.150 k
press: 1.00000 atm
elementType: 8 8 8 8 7 7 7 6 6 6 6 6 6 6 6 6 6 6 6 6 1 1 1 1 1 1 1 1 1 1 1
symmnumber: 1
zpe: 593673.4 jmol-1
zpe.correction: 0.226118 hartree
zpe.thermalcorrener: 0.242906 hartree
zpe.thermalcorrenthalpy: 0.243850 hartree
zpe.thermalcorrgfe: 0.179285 hartree
zpe.sumelectzpe: -965.621099 hartree
zpe.sumelectthermal: -965.604311 hartree
zpe.sumelectthermalent: -965.603367 hartree
zpe.sumelectthermalfe: -965.667933 hartree
dipole: -4.4982 3.8926 2.4940
dipole: 6.4503
quadrupole: -102.3395 -127.9248 -112.1823
quadrupole: -4.0383 -8.0931 -4.7322
quadrupole: 11.8094 -13.7760 1.9666 -4.0383 -8.0931 -4.7322
hfenergy: -965.8472173 hartree
pointgroup: C01 [X(C13H11N3O4)]
dipole: -1.793894 1.2706905 1.2678548 debye
polarizability: 224.1474151|-3.464745|192.4407069|-3.4730904|25.2608692|128.5229828 unknown
InChI: InChI=1S/C13H11N3O4/c17-13(15-10-4-3-7-14-8-10)9-20-12-6-2-1-5-11(12)16(18)19/h1-8,15H,9H2
charge 0 multiplicity 1
31 atoms
O  -1.073062 1.538518 -1.277753
O  1.87317 2.980467 0.354129
O  -2.424802 -2.118174 -2.202392
O  -0.445028 -1.057895 -1.858315
N  1.436048 0.823458 -0.516826
N  -1.712109 -1.215479 -1.623988
N  3.728378 -2.068371 -0.139529
C  -1.956151 0.970074 -0.361476
C  -2.362341 -0.377112 -0.598506
C  -0.181741 2.644145 -0.881639
C  -2.561571 1.674438 0.707248
C  1.146703 2.149329 -0.270716
C  -3.385903 -0.980631 0.166934
C  2.593137 0.105294 -0.1094
C  -3.554339 1.055793 1.49491
C  -3.98038 -0.266871 1.222777
C  3.662387 0.677521 0.630502
C  2.678678 -1.270915 -0.470121
C  4.751908 -0.1524 0.971934
C  4.750819 -1.508152 0.575504
H  -0.649675 3.349482 -0.175148
H  0.030941 3.178504 -1.822579
H  -2.278917 2.70961 0.916928
H  -3.681558 -2.006143 -0.071312
H  0.727627 0.283594 -1.047018
H  -4.007049 1.617657 2.318447
H  -4.759524 -0.735071 1.830585
H  3.627013 1.729936 0.917215
H  1.87305 -1.742423 -1.047619
H  5.595368 0.252062 1.54077
H  5.582017 -2.175849 0.827052
