program: Gaussian 09
title: 000027454
version: EM64L-G09RevD.01
frameworkgroup: C1[X(C19H23NO3)]
method: RPBEPBE
basis: SDD
operation: Freq
keyword: #p
keyword: freq=noraman
keyword: PBEPBE/SDD
title: #p freq=noraman PBEPBE/SDD
converged: YES YES NO NO
title: Mulliken charges:
elementType: O O O N C C C C C C C C C C C C C C C C C C C H H H H H H H H H H H H H H H H H H H H H H H
charge: -0.462579 -0.230168 -0.267133 -0.313513 -0.062076 -0.228903 -0.370672 -0.726373 0.406669 -0.541817 -0.388090 -0.402099 0.122070 0.297812 -0.238181 -0.221383 -0.244408 -0.483597 -0.368085 0.326531 -0.218470 -0.346046 -0.536788 0.170056 0.187740 0.233831 0.246102 0.199629 0.241168 0.245681 0.219904 0.257506 0.218296 0.262664 0.284218 0.338119 0.220031 0.221308 0.223140 0.290355 0.247371 0.231542 0.257115 0.246043 0.227308 0.228172
chargesum: 0.00000
title: Mulliken charges with hydrogens summed into heavy atoms:
elementType: O O O N C C C C C C C C C C C C C C C C C C C
charge: -0.124460 -0.230168 -0.267133 -0.079682 0.107980 -0.041164 0.075058 -0.019620 0.406669 -0.066015 -0.125426 -0.117881 0.122070 0.297812 -0.018150 -0.000075 -0.021268 -0.193242 -0.120714 0.326531 0.013072 -0.088931 0.164735
polarizability: 2.99993203e+02 -7.17644709e+00 2.16743516e+02 4.87813868e+00 -9.32747099e+00 1.55031055e+02
1716.lowfreq: -12.9464 -4.9861 -0.0005 0.0004 0.0007 1.4788 7.5714 12.2929 16.8051
frequency: 7.2376 12.2120 16.7749 30.9614 45.3574 77.2980 89.1674 100.5979 113.6347 120.7626 143.5479 152.3529 157.8133 180.7184 203.9475 217.8396 244.1331 255.5373 262.3325 285.6878 294.6246 310.0581 367.4812 374.0787 402.4219 419.0810 421.2608 437.5540 457.6818 468.6513 503.5889 534.6445 547.4818 560.4954 617.4952 620.3406 642.8515 649.7264 691.9954 704.6986 708.1579 741.1716 748.8120 785.8057 807.6790 817.8615 841.0486 858.9528 864.3996 900.3334 913.8761 925.7903 941.2380 976.7991 980.1767 980.3696 986.3102 991.7341 996.4608 997.9021 1025.8074 1028.6899 1040.7837 1051.8862 1068.3730 1082.4559 1086.1220 1088.5202 1112.5684 1133.6161 1150.8666 1155.1112 1159.0842 1168.4528 1170.6776 1177.6714 1187.4461 1190.0617 1217.7598 1243.2571 1271.1444 1276.0103 1290.9337 1293.2000 1311.2028 1322.1041 1337.8129 1371.5605 1382.1499 1386.2880 1398.1955 1401.6325 1419.7171 1436.0851 1436.3889 1446.1210 1465.8631 1466.7020 1467.6643 1470.8665 1479.7093 1480.4849 1484.5363 1489.6682 1573.8174 1591.5369 1593.0997 1610.4892 1615.5606 2772.5469 2892.3876 2897.8809 2962.9771 2966.7930 2993.7208 3016.6432 3057.1127 3069.2876 3088.2461 3100.6804 3118.7954 3130.2099 3130.8115 3139.7500 3147.1995 3158.8863 3159.7933 3161.8057 3174.2462 3179.2323 3383.0080 3563.1395
redmass: 4.3436 3.9493 5.5974 6.1747 5.7748 3.1082 3.5459 3.0665 2.2885 4.3097 3.3787 4.8726 3.1547 4.7093 1.6644 4.1449 2.2367 1.3405 1.8949 2.1300 1.9945 2.4339 4.3295 4.7858 2.8539 3.2107 4.1780 4.8370 3.5204 4.7297 3.1076 3.3244 4.3245 4.1680 6.4085 2.9982 6.2915 3.6268 1.9998 1.8644 1.7283 3.1618 2.2113 1.4385 2.8669 1.4506 3.6871 1.2653 2.8115 1.4603 1.4184 1.5700 1.9827 6.3610 1.5084 1.3418 6.4771 4.4524 4.7218 1.3272 2.8859 2.2486 1.9255 1.7451 2.0685 1.8215 1.8777 1.7216 1.2614 1.6952 1.4377 1.4268 2.4333 1.4977 1.0544 1.2188 1.4813 1.3904 1.4501 2.6962 1.2752 1.3288 1.3148 1.3614 1.6168 1.3079 1.4079 1.5460 3.9422 1.4938 1.5668 8.3956 1.9523 2.1441 1.1416 1.5034 1.2597 1.0595 1.2842 1.0659 1.3732 1.2525 2.1851 1.0932 7.8904 6.2924 6.4751 6.9403 6.0373 1.0799 1.0827 1.0722 1.0615 1.0327 1.0355 1.0948 1.1042 1.0898 1.0991 1.1004 1.0846 1.1001 1.0894 1.0867 1.0940 1.0985 1.0913 1.0915 1.0987 1.0949 1.0731 1.0657
irintensity: 0.0234 0.2590 0.1738 0.5906 1.9214 2.6226 3.4107 7.1637 0.4801 3.2532 0.4259 0.8812 0.4322 8.5096 1.6161 4.3405 18.6650 0.1031 1.2799 49.8331 63.0088 46.4876 2.1250 4.7815 0.9125 0.5103 4.6183 1.3553 2.4765 13.6503 3.0209 24.1023 8.6285 14.1429 0.2633 0.4849 9.0500 14.2697 25.0575 50.4001 59.2299 52.9164 44.9902 56.1344 8.5678 2.1190 22.3109 0.8765 7.5219 8.4938 17.6223 10.3869 6.5207 23.2853 1.7114 0.3818 35.3712 0.2524 60.3719 1.1489 21.9907 8.1734 4.7951 22.7284 6.6610 3.1829 1.6628 2.2775 0.1980 16.8945 65.5875 33.7998 84.2151 38.9648 0.5429 9.7581 35.1220 4.7227 4.8868 142.7439 90.8912 4.2486 47.3187 15.3834 153.7198 1.3869 18.5451 30.8351 8.8587 24.2588 14.3074 25.1225 97.2842 9.8330 11.3455 19.4704 36.3577 17.1625 73.2821 11.2953 5.7807 15.9245 16.9773 2.1638 162.5960 0.2764 2.2861 45.4398 6.8289 154.2178 71.1408 75.8484 26.8431 50.6160 15.3389 10.4749 42.2991 19.0868 32.8060 20.2511 0.0733 27.0381 19.2726 7.8345 24.8886 25.4727 18.0814 0.5202 11.3137 7.1271 4.3379 4.1435
temp: 298.150 k
press: 1.00000 atm
elementType: 8 8 8 7 6 6 6 6 6 6 6 6 6 6 6 6 6 6 6 6 6 6 6 1 1 1 1 1 1 1 1 1 1 1 1 1 1 1 1 1 1 1 1 1 1 1
symmnumber: 1
zpe: 992206.1 jmol-1
zpe.correction: 0.377911 hartree
zpe.thermalcorrener: 0.401009 hartree
zpe.thermalcorrenthalpy: 0.401953 hartree
zpe.thermalcorrgfe: 0.320853 hartree
zpe.sumelectzpe: -1016.504266 hartree
zpe.sumelectthermal: -1016.481169 hartree
zpe.sumelectthermalent: -1016.480225 hartree
zpe.sumelectthermalfe: -1016.561324 hartree
dipole: -2.8668 -0.1389 -1.7808
dipole: 3.3777
quadrupole: -141.6410 -129.8261 -132.7547
quadrupole: -1.1951 -2.3037 2.0409
quadrupole: -6.9004 4.9145 1.9859 -1.1951 -2.3037 2.0409
hfenergy: -1016.8821775 hartree
pointgroup: C01 [X(C19H23N1O3)]
dipole: -1.1261388 -0.1588841 -0.687386 debye
polarizability: 300.0586789|-5.8523359|212.8955154|6.0943317|-17.4449763|158.8135792 unknown
InChI: InChI=1S/C19H23NO3/c1-14(19(22)15-7-4-3-5-8-15)20-12-11-18(21)16-9-6-10-17(13-16)23-2/h3-10,13-14,19-20,22H,11-12H2,1-2H3
charge 0 multiplicity 1
46 atoms
O  5.053879 -2.099388 -0.937062
O  -2.337766 -1.696955 1.064447
O  -7.129982 0.14276 0.522014
N  1.55068 -0.867117 -0.479133
C  2.748621 -1.671166 -0.127585
C  3.994914 -1.079141 -0.874901
C  0.263504 -1.327798 0.094113
C  2.969442 -1.758068 1.392799
C  4.601702 0.170878 -0.24179
C  -0.870065 -0.411539 -0.392966
C  3.834857 1.360246 -0.137642
C  5.935052 0.16674 0.23583
C  -2.230379 -0.763101 0.213652
C  -3.437652 0.027806 -0.210448
C  4.393692 2.523411 0.436726
C  6.493089 1.332915 0.808536
C  5.726649 2.51601 0.910822
C  -4.687676 -0.316461 0.373026
C  -3.363267 1.084225 -1.153923
C  -5.851047 0.394341 0.010843
C  -4.536983 1.788635 -1.509599
C  -5.776949 1.45138 -0.936081
C  -7.26227 -0.932314 1.512022
H  2.640693 -2.724934 -0.513012
H  3.665424 -0.833788 -1.913599
H  1.475556 -0.775206 -1.505212
H  0.317808 -1.27643 1.193961
H  0.024321 -2.388152 -0.16006
H  3.964651 -2.193065 1.593178
H  2.929333 -0.753801 1.847811
H  2.213639 -2.399848 1.878339
H  -0.6173 0.638233 -0.140717
H  -0.950446 -0.446705 -1.500157
H  2.794035 1.354359 -0.477093
H  6.523287 -0.749823 0.144379
H  4.662253 -2.938316 -1.28874
H  3.789335 3.434784 0.514425
H  7.527497 1.317154 1.171264
H  6.161301 3.42041 1.352138
H  -4.695388 -1.137093 1.096963
H  -2.40776 1.363411 -1.607544
H  -4.486072 2.60587 -2.236884
H  -6.69538 1.985242 -1.19878
H  -8.329539 -0.948361 1.776032
H  -6.966275 -1.909342 1.084302
H  -6.655118 -0.723196 2.413509
