program: Gaussian 09
title: 000293789
version: EM64L-G09RevD.01
frameworkgroup: C1[X(C9H10FNO4S)]
method: RPBEPBE
basis: SDD
operation: Freq
keyword: #p
keyword: freq=noraman
keyword: PBEPBE/SDD
title: #p freq=noraman PBEPBE/SDD
converged: YES YES NO NO
title: Mulliken charges:
elementType: S F O O O O N C C C C C C C C C H H H H H H H H H H
charge: 1.098593 -0.339436 -0.233475 -0.498558 -0.458436 -0.255858 -0.450075 -0.284759 0.542935 0.441535 -0.482631 -0.349220 -0.302033 0.223192 -0.527919 -0.796284 0.291733 0.319345 0.257099 0.323538 0.231281 0.229317 0.264063 0.241533 0.272621 0.241898
chargesum: 0.00000
title: Mulliken charges with hydrogens summed into heavy atoms:
elementType: S F O O O O N C C C C C C C C C
charge: 1.098593 -0.339436 -0.233475 -0.498558 -0.458436 -0.255858 -0.126536 -0.284759 0.542935 0.441535 -0.190898 -0.029875 -0.044934 0.223192 0.196742 -0.040232
polarizability: 2.21073292e+02 8.50257416e+00 1.61196948e+02 -4.75945961e+00 9.96538226e-01 8.09556885e+01
1716.lowfreq: -72.7784 -7.0057 -0.0015 -0.0014 0.0020 1.1641 3.0699 39.9535 50.5391
frequency: -72.7754 39.9438 50.5220 62.8930 87.1200 99.9715 112.9841 130.3585 159.1271 189.2320 204.1403 222.7063 231.9270 259.5978 293.2738 306.8427 318.6975 350.5232 369.7354 429.8587 446.8593 478.7945 546.8384 549.9047 574.0723 598.3812 615.6104 646.3439 668.6166 720.8822 753.4990 837.5391 839.8725 858.6364 891.0809 938.0970 973.7157 984.7469 987.3656 991.7893 1024.1221 1032.6276 1113.5963 1141.3742 1167.5170 1216.9569 1232.5544 1262.7003 1292.8060 1350.2886 1379.2930 1418.6086 1436.4794 1447.6585 1466.7077 1467.7628 1471.5287 1491.7753 1500.2209 1570.1077 1630.5967 1634.9059 2976.0719 2990.3961 3071.8478 3075.4174 3134.1569 3138.5364 3146.3637 3166.1067 3192.5349 3526.4172
redmass: 1.0529 10.6814 7.4897 3.4540 5.4975 6.8561 3.9464 4.2693 4.3152 9.5125 7.6027 1.8880 2.2782 5.7178 7.1673 9.3251 9.6049 4.2227 5.2155 10.2375 4.0522 4.9477 7.0478 5.6811 3.5722 2.9266 5.7402 1.2846 7.2122 3.3950 5.3117 1.4732 5.9098 11.5368 1.5069 6.8996 6.0291 5.4141 2.2462 1.3439 2.9342 1.6625 1.2526 1.3668 1.2921 2.6311 1.8971 1.9362 2.4779 4.4528 1.2415 4.6785 1.2113 1.1636 1.0937 1.0463 1.0495 2.0714 2.7346 4.8827 7.1392 4.9850 1.0324 1.0385 1.1050 1.0983 1.0920 1.0980 1.1004 1.0897 1.0955 1.0768
irintensity: 0.0577 1.8935 5.9869 10.6094 2.0437 5.3332 2.4376 7.1686 1.5719 1.7887 0.5699 0.7051 1.2227 3.7245 2.2178 4.2048 4.6049 2.6789 0.6859 71.7692 33.3376 17.7406 97.8628 58.5988 4.0641 3.9133 0.0775 72.6042 7.1265 7.0276 13.7735 38.1867 15.1724 98.2601 38.6434 10.6451 25.0338 62.0134 66.8727 3.4038 12.5567 8.3974 0.0455 24.8273 10.5102 36.0695 156.8011 117.0468 21.8439 133.3335 56.4230 29.3377 45.6556 65.0312 58.1534 21.0099 16.0492 33.5978 610.4596 44.3748 9.3520 148.4721 53.5060 6.0402 33.2333 12.5832 13.9458 5.4572 9.4101 4.6293 12.9417 16.8831
temp: 298.150 k
press: 1.00000 atm
elementType: 16 9 8 8 8 8 7 6 6 6 6 6 6 6 6 6 1 1 1 1 1 1 1 1 1 1
symmnumber: 1
zpe: 478447.3 jmol-1
zpe.correction: 0.182231 hartree
zpe.thermalcorrener: 0.198486 hartree
zpe.thermalcorrenthalpy: 0.199430 hartree
zpe.thermalcorrgfe: 0.137572 hartree
zpe.sumelectzpe: -1201.139165 hartree
zpe.sumelectthermal: -1201.122911 hartree
zpe.sumelectthermalent: -1201.121967 hartree
zpe.sumelectthermalfe: -1201.183824 hartree
dipole: -4.7927 2.5196 -0.4036
dipole: 5.4296
quadrupole: -111.1733 -89.4124 -105.8136
quadrupole: 31.0231 -0.0911 0.7101
quadrupole: -9.0402 12.7207 -3.6805 31.0231 -0.0911 0.7101
hfenergy: -1201.3213964 hartree
pointgroup: C01 [X(C9H10F1N1O4S1)]
dipole: -1.836569 1.0909838 0.0078475 debye
dipolederiv: 1.7223506 -0.4790129 -0.0135015 -0.4492582 1.6318331 0.0677689 0.0177246 0.0242328 1.5612174 -0.5676463 0.1542965 -0.1472532 0.0936914 -0.3791075 -0.0306325 -0.3459287 0.1304083 -0.7947665 -1.2336878 -0.8910348 -0.1424784 -0.6176434 -0.7970104 -0.0904072 -0.1158624 -0.0780581 -0.2474595 -0.5584902 0.004152 0.0148239 0.0948005 -0.6962792 -0.0491605 0.0618995 -0.0495098 -0.4301284 -0.622616 0.1102235 0.1039693 0.0902092 -0.4880272 0.0255143 0.1436908 -0.0071524 -0.4747737 -0.8257071 -0.0267753 0.0059926 0.6032109 -0.8108828 -0.0804876 0.1021383 -0.070867 -0.3471365 -2.0783092 -0.0603528 0.0245026 0.0712476 -0.3277715 -0.0044249 0.0562938 -0.0130721 -0.321395 -0.2609883 0.1593961 0.0395691 -0.2316162 -0.2182865 0.0270043 0.1047978 -0.1054515 -0.1978979 1.1040666 0.3994484 0.0406912 0.6523213 -0.1543529 -0.0519457 0.0547453 -0.0293778 0.0807192 0.9751478 1.0377665 0.1642975 0.2265967 0.2439963 0.0240855 0.0427924 0.0041452 0.1258936 -0.0903885 -0.3981453 -0.0647516 0.3306345 -0.1622756 -0.0162207 -0.0009141 0.039667 -0.1181483 -0.0891504 0.1616859 0.0253438 -0.238358 0.1661788 0.0516055 -0.0394217 0.0458773 -0.1067737 -0.2866277 -0.3799888 -0.0644226 0.2277788 0.0627549 0.0368917 0.0537285 0.035094 -0.1662479 2.1091219 -0.0044586 -0.039466 -0.8244775 1.0080986 0.1378617 -0.159772 0.1170824 0.1920628 0.3265772 0.1715017 0.0301571 0.4717344 0.8016615 0.0763983 0.087331 0.076737 0.3239793 -0.3328532 -0.1656278 -0.0162042 -0.3056756 -0.1966589 -0.0298745 -0.0388722 -0.0301331 0.046984 0.1434941 -0.0331675 -0.002982 -0.0862276 0.0631347 -0.0187738 0.0036017 -0.0234094 0.1631724 0.1771402 0.0594761 0.0101066 0.0341147 0.1160846 -0.0107928 -0.0021061 -0.005372 0.172687 0.0638292 -0.0147173 -0.0001788 -0.0306195 -0.0508686 -0.0355345 -0.0044371 -0.0345427 0.1570604 0.1687084 0.0390794 0.0085946 0.0002681 0.117461 -0.0285932 0.0015365 -0.0254556 0.3023726 0.0783187 0.068246 0.1123691 -0.0837412 -0.0434407 -0.0390761 0.0300994 -0.0831102 -0.0899077 0.0742359 0.1038422 -0.0861443 -0.0663793 -0.089304 0.0443746 -0.0603474 0.0847896 -0.0440039 -0.0882241 -0.0670255 -0.0098604 -0.008234 0.0772426 -0.0098271 0.0012796 -0.0068657 0.1258406 0.0628078 -0.0021952 0.0490074 -0.0311129 0.0634823 -0.0806515 -0.0058693 -0.0942741 -0.0533721 -0.0323029 0.0364069 0.009261 0.1019176 0.0580195 -0.0138039 0.0189009 -0.0119787 0.1315894 0.0611932 0.0169805 -0.051443 -0.0251824 0.0043178 0.0987019 -0.0070291 0.1105966 0.0084323 unknown
polarizability: 221.6940817|6.3218198|158.5518896|-4.6489999|12.4048506|82.9799576 unknown
InChI: InChI=1S/C9H10FNO4S/c1-6(12)11-7-3-4-8(15-2)9(5-7)16(10,13)14/h3-5,11H,1-2H3
charge 0 multiplicity 1
26 atoms
S  2.475746 -1.637353 -0.260624
F  3.173115 -1.551474 1.45628
O  2.589639 1.344005 0.271395
O  1.86765 -3.120847 -0.422948
O  3.628073 -1.123099 -1.247769
O  -4.059161 1.041548 0.322474
N  -2.648672 -0.808698 0.016426
C  1.044737 -0.457983 -0.02206
C  -1.367163 -0.198573 0.083466
C  1.275695 0.919978 0.211225
C  -0.231932 -1.030795 -0.08023
C  -1.172157 1.192489 0.307763
C  0.12515 1.735047 0.369043
C  -3.90592 -0.199604 0.134441
C  2.85438 2.767689 0.52272
C  -5.07427 -1.175393 0.016303
H  -0.324338 -2.110461 -0.248723
H  -2.048151 1.831491 0.433416
H  0.240188 2.807506 0.549954
H  -2.650151 -1.820502 -0.134119
H  2.447271 3.076422 1.503546
H  2.432544 3.395562 -0.284162
H  3.949747 2.848186 0.52799
H  -5.076165 -1.684589 -0.965248
H  -6.012312 -0.612705 0.123116
H  -5.033045 -1.949246 0.805024
