program: Gaussian 09
title: 000293787
version: EM64L-G09RevD.01
frameworkgroup: C1[X(C13H9Cl3N2O2)]
method: RPBEPBE
basis: SDD
operation: Freq
keyword: #p
keyword: freq=noraman
keyword: PBEPBE/SDD
title: #p freq=noraman PBEPBE/SDD
converged: YES YES NO NO
title: Mulliken charges:
elementType: Cl Cl Cl O O N N C C C C C C C C C C C C C H H H H H H H H H
charge: 0.001701 0.001578 -0.025198 -0.222803 -0.191761 -0.455858 0.002789 0.548887 -0.418903 0.187807 0.475185 -0.237639 -0.237655 -0.226832 -0.226880 -0.088937 -0.349305 -0.417321 -0.149901 -0.353515 0.241201 0.241228 0.306094 0.286718 0.286722 0.228236 0.315832 0.233021 0.245510
chargesum: 0.00000
title: Mulliken charges with hydrogens summed into heavy atoms:
elementType: Cl Cl Cl O O N N C C C C C C C C C C C C C
charge: 0.001701 0.001578 -0.025198 -0.222803 -0.191761 -0.149763 0.002789 0.548887 0.063526 0.187807 0.475185 -0.237639 -0.237655 0.059885 0.059842 -0.088937 -0.121069 -0.101489 0.083120 -0.108005
polarizability: 3.04360095e+02 -1.66824951e-02 1.54063966e+02 8.22707863e+00 1.46472760e-01 1.28776055e+02
1716.lowfreq: -50.7919 -7.8938 -0.0014 -0.0013 -0.0011 0.4213 3.6173 9.2380 13.2439
frequency: -50.7804 8.2015 12.9905 26.6407 61.0167 63.2550 76.6210 113.8588 138.0141 173.0069 179.5456 196.7934 213.3079 226.2648 258.1102 273.6482 330.4056 348.0091 376.1253 402.5344 406.9696 414.5117 495.8497 504.1996 537.6630 559.9272 570.4290 572.2713 608.1456 622.5054 676.0834 703.1091 714.6289 754.9243 757.4553 806.5726 810.1901 837.1049 853.9250 861.3415 906.4034 924.7078 944.9319 971.0435 985.5174 992.3093 998.0572 1031.6611 1052.4546 1105.7330 1120.8093 1154.6157 1179.5726 1198.2323 1201.1101 1227.3207 1253.7875 1309.5833 1328.5811 1340.0993 1345.5578 1371.5506 1407.9610 1422.5804 1452.6750 1457.2903 1498.7457 1551.9428 1569.8371 1573.0095 1588.0161 1662.2153 2949.1676 3007.0583 3113.8035 3138.5353 3166.7872 3187.9053 3189.2794 3194.3332 3490.0521
redmass: 3.3648 6.0820 7.6488 14.0704 5.4621 4.8724 9.0493 12.0606 12.0608 24.0359 11.5274 4.9236 11.0606 3.6832 10.8579 7.4897 6.7619 32.5054 9.4340 3.2245 7.9976 10.5439 3.3540 5.0553 6.7240 4.2731 6.6818 3.2741 7.6651 1.2371 7.7799 6.4402 1.9836 11.2337 7.5727 7.3833 1.7460 7.3559 1.4214 1.3601 1.3383 6.4660 1.4287 1.3912 1.9323 4.8349 5.7713 2.8716 3.3022 2.9037 1.5524 2.8310 1.5068 1.3178 1.0666 3.9424 2.1956 4.2858 1.4792 5.7238 1.4774 4.6106 2.1590 2.8146 1.2561 1.9277 2.2072 9.6120 3.7953 7.8420 5.9165 6.4924 1.0542 1.1056 1.0904 1.0896 1.0994 1.0932 1.0940 1.0939 1.0762
irintensity: 0.7876 4.9742 5.6140 0.4852 4.7020 0.1507 0.5004 0.6918 0.1077 0.2862 1.1732 0.0103 2.0982 0.2801 1.2715 2.2052 2.8789 0.4408 9.1182 3.8302 5.2133 5.6946 8.5104 0.0068 6.4852 13.2195 1.0400 0.2998 1.4926 49.3685 18.9520 17.2587 43.3102 78.5563 49.7940 14.2905 59.4105 2.1363 41.8485 0.0082 0.2720 30.5503 11.9508 0.4466 0.1446 19.6691 33.8773 0.5115 40.4556 48.4015 17.1395 123.7369 5.0643 21.2162 0.3506 128.1979 34.8015 96.7096 21.0506 16.4020 4.3078 23.3649 153.1803 273.5822 3.1475 68.8805 310.2095 63.1666 63.6642 44.3481 54.9113 138.6531 46.4320 12.1122 14.3617 11.7880 27.5993 2.7719 0.7842 1.9235 8.6681
temp: 298.150 k
press: 1.00000 atm
elementType: 17 17 17 8 8 7 7 6 6 6 6 6 6 6 6 6 6 6 6 6 1 1 1 1 1 1 1 1 1
symmnumber: 1
zpe: 509076.8 jmol-1
zpe.correction: 0.193897 hartree
zpe.thermalcorrener: 0.211933 hartree
zpe.thermalcorrenthalpy: 0.212877 hartree
zpe.thermalcorrgfe: 0.142574 hartree
zpe.sumelectzpe: -2139.463512 hartree
zpe.sumelectthermal: -2139.445476 hartree
zpe.sumelectthermalent: -2139.444532 hartree
zpe.sumelectthermalfe: -2139.514835 hartree
dipole: 1.0059 0.0278 7.3314
dipole: 7.4002
quadrupole: -137.2344 -135.9563 -138.0178
quadrupole: -0.1206 -23.5001 0.0092
quadrupole: -0.1649 1.1132 -0.9483 -0.1206 -23.5001 0.0092
hfenergy: -2139.6574095 hartree
pointgroup: C01 [X(C13H9Cl3N2O2)]
dipole: -0.3483472 -0.0010219 -2.890542 debye
polarizability: 304.0425173|0.1101217|154.0623989|11.1055918|-0.2452829|129.0952006 unknown
InChI: InChI=1S/C13H9Cl3N2O2/c14-8-4-10(15)13(11(16)5-8)20-7-12(19)18-9-2-1-3-17-6-9/h1-6,18H,7H2
charge 0 multiplicity 1
29 atoms
Cl -2.284664 -2.778806 0.322655
Cl -2.288976 2.78121 0.306796
Cl -6.957658 -0.005651 -0.812106
O  -1.122979 0.003395 0.737766
O  1.45042 0.000118 1.587967
N  2.303456 0.000827 -0.603963
N  5.658288 0.000231 1.094386
C  -2.448674 0.001022 0.288679
C  -0.113793 0.000478 -0.327557
C  1.274953 -0.000417 0.346633
C  3.707833 0.001276 -0.379911
C  -3.164062 -1.210518 0.108104
C  -3.166011 1.210365 0.101286
C  -4.531981 -1.236002 -0.223906
C  -4.533976 1.231796 -0.230786
C  -5.192661 -0.003078 -0.386796
C  4.562829 0.003055 -1.514151
C  4.306398 -0.000068 0.915242
C  5.95793 0.003379 -1.325747
C  6.465144 0.001911 -0.005517
H  -0.227353 0.904624 -0.961642
H  -0.229498 -0.905186 -0.959053
H  2.019989 0.001646 -1.589017
H  -5.060619 -2.183732 -0.347095
H  -5.064144 2.177956 -0.359256
H  4.141631 0.004162 -2.52782
H  3.685846 -0.001403 1.812928
H  6.639171 0.004733 -2.182263
H  7.543363 0.002078 0.187642
